[Networkit] Failed tests in the Dev branch

Elisabetta Bergamini elisabetta.bergamini at kit.edu
Wed Jun 1 12:09:40 CEST 2016


Dear NetworKit developers,

I’ve noticed that the following tests fail in the Dev branch:

[----------] Global test environment tear-down
[==========] 814 tests from 50 test cases ran. (133212 ms total)
[  PASSED  ] 810 tests.
[  FAILED  ] 4 tests, listed below:
[  FAILED  ] GeneratorsGTest.testLFRGeneratorImpossibleSequence
[  FAILED  ] MatcherGTest.testPgaMatching
[  FAILED  ] LocalDegreeGTest.testAttributeSimple
[  FAILED  ] PartitionGTest.testVectorConstructor

Does anybody know what causes these errors? Who would be willing to fix them?
Thank you,

Elisabetta

==========================================================
Karlsruhe Institute of Technology (KIT)
Institute of Theoretical Informatics (ITI)

Elisabetta Bergamini
Theoret. Informatics / Parallel Computing

Phone: +49-721-608-41821
Web: http://parco.iti.kit.edu/bergamini

KIT - The Research University in the Helmholtz Association
==========================================================

-------------- next part --------------
An HTML attachment was scrubbed...
URL: <http://lists.ira.uni-karlsruhe.de/pipermail/networkit/attachments/20160601/07bd95e1/attachment.html>


More information about the NetworKit mailing list