[palladio-dev] Build failed in Jenkins: Palladio Core #723

webmaster-sdq at ipd.uka.de webmaster-sdq at ipd.uka.de
Thu Mar 6 22:13:30 CET 2014


See <https://sdqweb.ipd.kit.edu/jenkins/job/Palladio%20Core/723/>

------------------------------------------
[...truncated 3968 lines...]
Warning: file <https://sdqweb.ipd.kit.edu/jenkins/job/Palladio%20Core/ws/de.uka.ipd.sdq.pcm.editor/src/de/uka/ipd/sdq/pcm/usagemodel/presentation/UsagemodelEditor.java,> line 1124: Class is a raw type. References to generic type Class<T> should be parameterized
Warning: file <https://sdqweb.ipd.kit.edu/jenkins/job/Palladio%20Core/ws/de.uka.ipd.sdq.pcm.editor/src/de/uka/ipd/sdq/pcm/system/presentation/SystemEditor.java,> line 1144: Class is a raw type. References to generic type Class<T> should be parameterized
Warning: file <https://sdqweb.ipd.kit.edu/jenkins/job/Palladio%20Core/ws/de.uka.ipd.sdq.pcm.editor/src/de/uka/ipd/sdq/pcm/subsystem/presentation/SubsystemEditor.java,> line 1121: Unnecessary @SuppressWarnings("unchecked")
Warning: file <https://sdqweb.ipd.kit.edu/jenkins/job/Palladio%20Core/ws/de.uka.ipd.sdq.pcm.editor/src/de/uka/ipd/sdq/pcm/subsystem/presentation/SubsystemEditor.java,> line 1123: Class is a raw type. References to generic type Class<T> should be parameterized
Warning: file <https://sdqweb.ipd.kit.edu/jenkins/job/Palladio%20Core/ws/de.uka.ipd.sdq.pcm.editor/src/de/uka/ipd/sdq/pcm/seff/seff_reliability/presentation/SeffReliabilityEditor.java,> line 1107: Unnecessary @SuppressWarnings("unchecked")
Warning: file <https://sdqweb.ipd.kit.edu/jenkins/job/Palladio%20Core/ws/de.uka.ipd.sdq.pcm.editor/src/de/uka/ipd/sdq/pcm/seff/seff_reliability/presentation/SeffReliabilityEditor.java,> line 1109: Class is a raw type. References to generic type Class<T> should be parameterized
Warning: file <https://sdqweb.ipd.kit.edu/jenkins/job/Palladio%20Core/ws/de.uka.ipd.sdq.pcm.editor/src/de/uka/ipd/sdq/pcm/seff/seff_performance/presentation/SeffPerformanceEditor.java,> line 1109: Class is a raw type. References to generic type Class<T> should be parameterized
Warning: file <https://sdqweb.ipd.kit.edu/jenkins/job/Palladio%20Core/ws/de.uka.ipd.sdq.pcm.editor/src/de/uka/ipd/sdq/pcm/seff/presentation/SeffEditor.java,> line 1109: Unnecessary @SuppressWarnings("unchecked")
Warning: file <https://sdqweb.ipd.kit.edu/jenkins/job/Palladio%20Core/ws/de.uka.ipd.sdq.pcm.editor/src/de/uka/ipd/sdq/pcm/resourcetype/presentation/ResourcetypeEditor.java,> line 1121: Unnecessary @SuppressWarnings("unchecked")
Warning: file <https://sdqweb.ipd.kit.edu/jenkins/job/Palladio%20Core/ws/de.uka.ipd.sdq.pcm.editor/src/de/uka/ipd/sdq/pcm/resourcetype/presentation/ResourcetypeEditor.java,> line 1123: Class is a raw type. References to generic type Class<T> should be parameterized
Warning: file <https://sdqweb.ipd.kit.edu/jenkins/job/Palladio%20Core/ws/de.uka.ipd.sdq.pcm.editor/src/de/uka/ipd/sdq/pcm/resourceenvironment/presentation/ResourceenvironmentEditor.java,> line 1145: Unnecessary @SuppressWarnings("unchecked")
Warning: file <https://sdqweb.ipd.kit.edu/jenkins/job/Palladio%20Core/ws/de.uka.ipd.sdq.pcm.editor/src/de/uka/ipd/sdq/pcm/repository/presentation/RepositoryEditor.java,> line 1149: Class is a raw type. References to generic type Class<T> should be parameterized
Warning: file <https://sdqweb.ipd.kit.edu/jenkins/job/Palladio%20Core/ws/de.uka.ipd.sdq.pcm.editor/src/de/uka/ipd/sdq/pcm/reliability/presentation/ReliabilityEditor.java,> line 1111: Class is a raw type. References to generic type Class<T> should be parameterized
Warning: file <https://sdqweb.ipd.kit.edu/jenkins/job/Palladio%20Core/ws/de.uka.ipd.sdq.pcm.editor/src/de/uka/ipd/sdq/pcm/qosannotations/qos_reliability/presentation/QosReliabilityEditor.java,> line 1109: Class is a raw type. References to generic type Class<T> should be parameterized
Warning: file <https://sdqweb.ipd.kit.edu/jenkins/job/Palladio%20Core/ws/de.uka.ipd.sdq.pcm.editor/src/de/uka/ipd/sdq/pcm/qosannotations/qos_performance/presentation/QosPerformanceEditor.java,> line 1109: Class is a raw type. References to generic type Class<T> should be parameterized
Warning: file <https://sdqweb.ipd.kit.edu/jenkins/job/Palladio%20Core/ws/de.uka.ipd.sdq.pcm.editor/src/de/uka/ipd/sdq/pcm/qosannotations/presentation/QosannotationsEditor.java,> line 1122: Unnecessary @SuppressWarnings("unchecked")
Warning: file <https://sdqweb.ipd.kit.edu/jenkins/job/Palladio%20Core/ws/de.uka.ipd.sdq.pcm.editor/src/de/uka/ipd/sdq/pcm/presentation/PcmEditor.java,> line 1111: Class is a raw type. References to generic type Class<T> should be parameterized
Warning: file <https://sdqweb.ipd.kit.edu/jenkins/job/Palladio%20Core/ws/de.uka.ipd.sdq.pcm.editor/src/de/uka/ipd/sdq/pcm/parameter/presentation/ParameterEditor.java,> line 1109: Unnecessary @SuppressWarnings("unchecked")
Warning: file <https://sdqweb.ipd.kit.edu/jenkins/job/Palladio%20Core/ws/de.uka.ipd.sdq.pcm.editor/src/de/uka/ipd/sdq/pcm/core/presentation/CoreEditor.java,> line 1108: Unnecessary @SuppressWarnings("unchecked")
Warning: file <https://sdqweb.ipd.kit.edu/jenkins/job/Palladio%20Core/ws/de.uka.ipd.sdq.pcm.editor/src/de/uka/ipd/sdq/pcm/core/presentation/CoreEditor.java,> line 1110: Class is a raw type. References to generic type Class<T> should be parameterized
Warning: file <https://sdqweb.ipd.kit.edu/jenkins/job/Palladio%20Core/ws/de.uka.ipd.sdq.pcm.editor/src/de/uka/ipd/sdq/pcm/core/entity/presentation/EntityEditor.java,> line 1111: Class is a raw type. References to generic type Class<T> should be parameterized
Warning: file <https://sdqweb.ipd.kit.edu/jenkins/job/Palladio%20Core/ws/de.uka.ipd.sdq.pcm.editor/src/de/uka/ipd/sdq/pcm/core/composition/presentation/CompositionEditor.java,> line 1109: Unnecessary @SuppressWarnings("unchecked")
Warning: file <https://sdqweb.ipd.kit.edu/jenkins/job/Palladio%20Core/ws/de.uka.ipd.sdq.pcm.editor/src/de/uka/ipd/sdq/pcm/core/composition/presentation/CompositionEditor.java,> line 1111: Class is a raw type. References to generic type Class<T> should be parameterized
Warning: file <https://sdqweb.ipd.kit.edu/jenkins/job/Palladio%20Core/ws/de.uka.ipd.sdq.pcm.editor/src/de/uka/ipd/sdq/pcm/allocation/presentation/AllocationEditor.java,> line 1120: Unnecessary @SuppressWarnings("unchecked")
Warning: file <https://sdqweb.ipd.kit.edu/jenkins/job/Palladio%20Core/ws/de.uka.ipd.sdq.pcm.editor/src/de/uka/ipd/sdq/pcm/allocation/presentation/AllocationEditor.java,> line 1122: Class is a raw type. References to generic type Class<T> should be parameterized
Warning: file <https://sdqweb.ipd.kit.edu/jenkins/job/Palladio%20Core/ws/de.uka.ipd.sdq.pcm.editor>: Build path specifies execution environment JavaSE-1.6. There are no JREs installed in the workspace that are strictly compatible with this environment. 
Warning: file <https://sdqweb.ipd.kit.edu/jenkins/job/Palladio%20Core/ws/de.uka.ipd.sdq.pcm.gmf.toolbar/plugin.xml,> line 6: The extension point 'org.eclipse.ui.actionSets' is deprecated
Warning: file <https://sdqweb.ipd.kit.edu/jenkins/job/Palladio%20Core/ws/de.uka.ipd.sdq.pcm.gmf.toolbar/plugin.xml,> line 20: Element 'action' is deprecated
Warning: file <https://sdqweb.ipd.kit.edu/jenkins/job/Palladio%20Core/ws/de.uka.ipd.sdq.pcm.gmf.toolbar/plugin.xml,> line 44: Element 'action' is deprecated
Warning: file <https://sdqweb.ipd.kit.edu/jenkins/job/Palladio%20Core/ws/de.uka.ipd.sdq.pcm.gmf.toolbar/plugin.xml,> line 65: Element 'action' is deprecated
Warning: file <https://sdqweb.ipd.kit.edu/jenkins/job/Palladio%20Core/ws/de.uka.ipd.sdq.pcm.gmf.toolbar/plugin.xml,> line 95: Element 'action' is deprecated
Warning: file <https://sdqweb.ipd.kit.edu/jenkins/job/Palladio%20Core/ws/de.uka.ipd.sdq.pcm.gmf.toolbar/plugin.xml,> line 108: Element 'action' is deprecated
Warning: file <https://sdqweb.ipd.kit.edu/jenkins/job/Palladio%20Core/ws/de.uka.ipd.sdq.pcm.gmf.toolbar/META-INF/MANIFEST.MF,> line 19: The JRE container on the classpath is not a perfect match to the 'JavaSE-1.6' execution environment
Warning: file <https://sdqweb.ipd.kit.edu/jenkins/job/Palladio%20Core/ws/de.uka.ipd.sdq.pcm.feature/feature.xml,> line 153: Feature reference 'de.uka.ipd.sdq.sensorframework.visualisation.feature' cannot be resolved
Warning: file <https://sdqweb.ipd.kit.edu/jenkins/job/Palladio%20Core/ws/de.uka.ipd.sdq.simucomframework.variables/src/de/uka/ipd/sdq/simucomframework/variables/stoexvisitor/PCMStoExEvaluationVisitor.java,> line 162: Comparable is a raw type. References to generic type Comparable<T> should be parameterized
Warning: file <https://sdqweb.ipd.kit.edu/jenkins/job/Palladio%20Core/ws/de.uka.ipd.sdq.simucomframework.variables/src/de/uka/ipd/sdq/simucomframework/variables/stoexvisitor/PCMProbfunctionEvaluationVisitor.java,> line 14: The import de.uka.ipd.sdq.simucomframework.variables.cache.StoExCache is never used
Warning: file <https://sdqweb.ipd.kit.edu/jenkins/job/Palladio%20Core/ws/de.uka.ipd.sdq.simucomframework.variables/src/de/uka/ipd/sdq/simucomframework/variables/exceptions/ValueNotInFrameException.java,> line 3: The serializable class ValueNotInFrameException does not declare a static final serialVersionUID field of type long
Warning: file <https://sdqweb.ipd.kit.edu/jenkins/job/Palladio%20Core/ws/de.uka.ipd.sdq.simucomframework.variables/src/de/uka/ipd/sdq/simucomframework/variables/exceptions/TypesIncompatibleInProductException.java,> line 3: The serializable class TypesIncompatibleInProductException does not declare a static final serialVersionUID field of type long
Warning: file <https://sdqweb.ipd.kit.edu/jenkins/job/Palladio%20Core/ws/de.uka.ipd.sdq.simucomframework.variables/src/de/uka/ipd/sdq/simucomframework/variables/exceptions/TypesIncompatibleInComparisionException.java,> line 3: The serializable class TypesIncompatibleInComparisionException does not declare a static final serialVersionUID field of type long
Warning: file <https://sdqweb.ipd.kit.edu/jenkins/job/Palladio%20Core/ws/de.uka.ipd.sdq.simucomframework.variables/src/de/uka/ipd/sdq/simucomframework/variables/exceptions/StochasticExpressionEvaluationFailedException.java,> line 3: The serializable class StochasticExpressionEvaluationFailedException does not declare a static final serialVersionUID field of type long
Warning: file <https://sdqweb.ipd.kit.edu/jenkins/job/Palladio%20Core/ws/de.uka.ipd.sdq.simucomframework.variables/src/de/uka/ipd/sdq/simucomframework/variables/exceptions/FunctionUnknownException.java,> line 3: The serializable class FunctionUnknownException does not declare a static final serialVersionUID field of type long
Warning: file <https://sdqweb.ipd.kit.edu/jenkins/job/Palladio%20Core/ws/de.uka.ipd.sdq.simucomframework.variables/src/de/uka/ipd/sdq/simucomframework/variables/exceptions/FunctionParametersNotAcceptedException.java,> line 3: The serializable class FunctionParametersNotAcceptedException does not declare a static final serialVersionUID field of type long
Warning: file <https://sdqweb.ipd.kit.edu/jenkins/job/Palladio%20Core/ws/de.uka.ipd.sdq.simucomframework.variables/src/de/uka/ipd/sdq/simucomframework/variables/cache/StoExCacheEntry.java,> line 7: The import org.antlr.runtime.RecognitionException is never used
Warning: file <https://sdqweb.ipd.kit.edu/jenkins/job/Palladio%20Core/ws/de.uka.ipd.sdq.simucomframework.variables/src/de/uka/ipd/sdq/simucomframework/variables/cache/ProbFunctionCache.java,> line 130: Sample is a raw type. References to generic type Sample<T> should be parameterized
Warning: file <https://sdqweb.ipd.kit.edu/jenkins/job/Palladio%20Core/ws/de.uka.ipd.sdq.simucomframework.variables/src/de/uka/ipd/sdq/simucomframework/variables/cache/ProbFunctionCache.java,> line 135: Sample is a raw type. References to generic type Sample<T> should be parameterized
Warning: file <https://sdqweb.ipd.kit.edu/jenkins/job/Palladio%20Core/ws/de.uka.ipd.sdq.simucomframework.variables/src/de/uka/ipd/sdq/simucomframework/variables/EvaluationProxy.java,> line 23: The serializable class EvaluationProxy does not declare a static final serialVersionUID field of type long
Warning: file <https://sdqweb.ipd.kit.edu/jenkins/job/Palladio%20Core/ws/de.uka.ipd.sdq.simucomframework.variables>: Build path specifies execution environment JavaSE-1.6. There are no JREs installed in the workspace that are strictly compatible with this environment. 
Warning: file <https://sdqweb.ipd.kit.edu/jenkins/job/Palladio%20Core/ws/de.uka.ipd.sdq.stoex.analyser.tests>: Build path specifies execution environment JavaSE-1.6. There are no JREs installed in the workspace that are strictly compatible with this environment. 
Warning: file <https://sdqweb.ipd.kit.edu/jenkins/job/Palladio%20Core/ws/de.uka.ipd.sdq.workflow.pcm/src/de/uka/ipd/sdq/workflow/pcm/jobs/LoadPCMModelsJob.java,> line 65: The method loadModel(String) from the type ResourceSetPartition is deprecated
Warning: file <https://sdqweb.ipd.kit.edu/jenkins/job/Palladio%20Core/ws/de.uka.ipd.sdq.workflow.pcm/src/de/uka/ipd/sdq/workflow/pcm/jobs/LoadMiddlewareConfigurationIntoBlackboardJob.java,> line 67: The method loadModel(String) from the type ResourceSetPartition is deprecated
Warning: file <https://sdqweb.ipd.kit.edu/jenkins/job/Palladio%20Core/ws/de.uka.ipd.sdq.workflow.pcm/src/de/uka/ipd/sdq/workflow/pcm/jobs/EventsTransformationJob.java,> line 106: The method loadModel(String) from the type ResourceSetPartition is deprecated
Warning: file <https://sdqweb.ipd.kit.edu/jenkins/job/Palladio%20Core/ws/de.uka.ipd.sdq.workflow.pcm/src/de/uka/ipd/sdq/workflow/pcm/configurations/AbstractPCMWorkflowRunConfiguration.java,> line 293: The value of the local variable fileLocation is not used
Warning: file <https://sdqweb.ipd.kit.edu/jenkins/job/Palladio%20Core/ws/de.uka.ipd.sdq.workflow.pcm>: Build path specifies execution environment JavaSE-1.6. There are no JREs installed in the workspace that are strictly compatible with this environment. 
Warning: file <https://sdqweb.ipd.kit.edu/jenkins/job/Palladio%20Core/ws/de.uka.ipd.sdq.simulation>: Build path specifies execution environment JavaSE-1.6. There are no JREs installed in the workspace that are strictly compatible with this environment. 
Warning: file <https://sdqweb.ipd.kit.edu/jenkins/job/Palladio%20Core/ws/de.fzi.se.quality.editor/src/de/fzi/se/quality/qualityannotation/presentation/QualityAnnotationEditor.java,> line 1374: Class is a raw type. References to generic type Class<T> should be parameterized
Warning: file <https://sdqweb.ipd.kit.edu/jenkins/job/Palladio%20Core/ws/de.fzi.se.quality.editor/src/de/fzi/se/quality/presentation/QualityEditor.java,> line 153: The import de.uka.ipd.sdq.pcmbench.ui.provider.PalladioItemProviderAdapterFactory is never used
Warning: file <https://sdqweb.ipd.kit.edu/jenkins/job/Palladio%20Core/ws/de.fzi.se.quality.editor/src/de/fzi/se/quality/presentation/QualityEditor.java,> line 1317: Class is a raw type. References to generic type Class<T> should be parameterized
Warning: file <https://sdqweb.ipd.kit.edu/jenkins/job/Palladio%20Core/ws/de.fzi.se.quality.editor/src/de/fzi/se/quality/parameters/presentation/ParametersEditor.java,> line 1373: Class is a raw type. References to generic type Class<T> should be parameterized
Warning: file <https://sdqweb.ipd.kit.edu/jenkins/job/Palladio%20Core/ws/de.fzi.se.quality.editor/src/de/fzi/se/quality/parameters/pcm/presentation/PCMEditor.java,> line 1374: Class is a raw type. References to generic type Class<T> should be parameterized
Warning: file <https://sdqweb.ipd.kit.edu/jenkins/job/Palladio%20Core/ws/de.fzi.se.quality.editor>: Build path specifies execution environment J2SE-1.5. There are no JREs installed in the workspace that are strictly compatible with this environment. 
Warning: file <https://sdqweb.ipd.kit.edu/jenkins/job/Palladio%20Core/ws/de.fzi.se.quality.editor/build.properties,> line 13: src-man/ is missing from source..
Warning: file <https://sdqweb.ipd.kit.edu/jenkins/job/Palladio%20Core/ws/de.fzi.se.accuracy>: Build path specifies execution environment JavaSE-1.6. There are no JREs installed in the workspace that are strictly compatible with this environment. 
Warning: file <https://sdqweb.ipd.kit.edu/jenkins/job/Palladio%20Core/ws/org.jfree.jfreechart/META-INF/MANIFEST.MF,> line 1: No required execution environment has been set
Warning: file <https://sdqweb.ipd.kit.edu/jenkins/job/Palladio%20Core/ws/de.uka.ipd.sdq.pcmsolver/src/de/uka/ipd/sdq/pcmsolver/visualisation/LQNResultEditorInput.java,> line 74: Class is a raw type. References to generic type Class<T> should be parameterized
Warning: file <https://sdqweb.ipd.kit.edu/jenkins/job/Palladio%20Core/ws/de.uka.ipd.sdq.pcmsolver/src/de/uka/ipd/sdq/pcmsolver/visitors/UsageModelVisitor.java,> line 39: The value of the field UsageModelVisitor.parameterFactory is not used
Warning: file <https://sdqweb.ipd.kit.edu/jenkins/job/Palladio%20Core/ws/de.uka.ipd.sdq.pcmsolver/src/de/uka/ipd/sdq/pcmsolver/visitors/SeffVisitor.java,> line 42: SeffSwitch is a raw type. References to generic type SeffSwitch<T> should be parameterized
Warning: file <https://sdqweb.ipd.kit.edu/jenkins/job/Palladio%20Core/ws/de.uka.ipd.sdq.pcmsolver/src/de/uka/ipd/sdq/pcmsolver/visitors/ExpressionParameterSolverVisitor.java,> line 25: The value of the field ExpressionParameterSolverVisitor.logger is not used
Warning: file <https://sdqweb.ipd.kit.edu/jenkins/job/Palladio%20Core/ws/de.uka.ipd.sdq.pcmsolver/src/de/uka/ipd/sdq/pcmsolver/visitors/EMFQueryHelper.java,> line 14: Class is a raw type. References to generic type Class<T> should be parameterized
Warning: file <https://sdqweb.ipd.kit.edu/jenkins/job/Palladio%20Core/ws/de.uka.ipd.sdq.pcmsolver/src/de/uka/ipd/sdq/pcmsolver/visitors/AggregatedContextSEFFVisitor.java,> line 182: The method isOrContainsAssemblyContext(AssemblyContext, AssemblyContext) from the type AggregatedContextSEFFVisitor is never used locally
Warning: file <https://sdqweb.ipd.kit.edu/jenkins/job/Palladio%20Core/ws/de.uka.ipd.sdq.pcmsolver/src/de/uka/ipd/sdq/pcmsolver/transformations/pcm2regex/TransformUsageModelVisitor.java,> line 189: The method getSeff(Signature, BasicComponent) from the type TransformUsageModelVisitor is never used locally
Warning: file <https://sdqweb.ipd.kit.edu/jenkins/job/Palladio%20Core/ws/de.uka.ipd.sdq.pcmsolver/src/de/uka/ipd/sdq/pcmsolver/transformations/pcm2regex/TransformSeffVisitor.java,> line 49: SeffSwitch is a raw type. References to generic type SeffSwitch<T> should be parameterized
Warning: file <https://sdqweb.ipd.kit.edu/jenkins/job/Palladio%20Core/ws/de.uka.ipd.sdq.pcmsolver/src/de/uka/ipd/sdq/pcmsolver/transformations/pcm2regex/ExpressionPrinter.java,> line 13: The value of the field ExpressionPrinter.newline is not used
Warning: file <https://sdqweb.ipd.kit.edu/jenkins/job/Palladio%20Core/ws/de.uka.ipd.sdq.pcmsolver/src/de/uka/ipd/sdq/pcmsolver/transformations/pcm2lqn/UsageModel2Lqn.java,> line 367: The value of the local variable et is not used
Warning: file <https://sdqweb.ipd.kit.edu/jenkins/job/Palladio%20Core/ws/de.uka.ipd.sdq.pcmsolver/src/de/uka/ipd/sdq/pcmsolver/transformations/pcm2lqn/ResultWindow.java,> line 27: The static field Frame.MAXIMIZED_BOTH should be accessed in a static way
Warning: file <https://sdqweb.ipd.kit.edu/jenkins/job/Palladio%20Core/ws/de.uka.ipd.sdq.pcmsolver/src/de/uka/ipd/sdq/pcmsolver/transformations/pcm2lqn/ResourceEnvironment2Lqn.java,> line 28: ResourceenvironmentSwitch is a raw type. References to generic type ResourceenvironmentSwitch<T> should be parameterized
Warning: file <https://sdqweb.ipd.kit.edu/jenkins/job/Palladio%20Core/ws/de.uka.ipd.sdq.pcmsolver/src/de/uka/ipd/sdq/pcmsolver/transformations/pcm2lqn/Rdseff2Lqn.java,> line 655: The value of the local variable adt is not used
Warning: file <https://sdqweb.ipd.kit.edu/jenkins/job/Palladio%20Core/ws/de.uka.ipd.sdq.pcmsolver/src/de/uka/ipd/sdq/pcmsolver/transformations/pcm2lqn/Rdseff2Lqn.java,> line 667: The value of the local variable et is not used
Warning: file <https://sdqweb.ipd.kit.edu/jenkins/job/Palladio%20Core/ws/de.uka.ipd.sdq.pcmsolver/src/de/uka/ipd/sdq/pcmsolver/transformations/pcm2lqn/Pcm2LqnStrategy.java,> line 306: The method showOutput(String) from the type Pcm2LqnStrategy is never used locally
Warning: file <https://sdqweb.ipd.kit.edu/jenkins/job/Palladio%20Core/ws/de.uka.ipd.sdq.pcmsolver/src/de/uka/ipd/sdq/pcmsolver/transformations/pcm2lqn/LqnBuilder.java,> line 386: The method getDoubleFromValue(Object) from the type LqnBuilder is never used locally
Warning: file <https://sdqweb.ipd.kit.edu/jenkins/job/Palladio%20Core/ws/de.uka.ipd.sdq.pcmsolver/src/de/uka/ipd/sdq/pcmsolver/transformations/ContextWrapper.java,> line 1104: The value of the local variable extCallIn is not used
Warning: file <https://sdqweb.ipd.kit.edu/jenkins/job/Palladio%20Core/ws/de.uka.ipd.sdq.pcmsolver/src/de/uka/ipd/sdq/pcmsolver/models/Context.java,> line 77: ArrayList is a raw type. References to generic type ArrayList<E> should be parameterized
Warning: file <https://sdqweb.ipd.kit.edu/jenkins/job/Palladio%20Core/ws/de.uka.ipd.sdq.pcmsolver/src/de/uka/ipd/sdq/pcmsolver/handler/InternalActionHandler.java,> line 47: Iterator is a raw type. References to generic type Iterator<E> should be parameterized
Warning: file <https://sdqweb.ipd.kit.edu/jenkins/job/Palladio%20Core/ws/de.uka.ipd.sdq.pcmsolver/src/de/uka/ipd/sdq/pcmsolver/handler/GuardedBranchTransitionHandler.java,> line 67: Sample is a raw type. References to generic type Sample<T> should be parameterized
Warning: file <https://sdqweb.ipd.kit.edu/jenkins/job/Palladio%20Core/ws/de.uka.ipd.sdq.pcmsolver/src/de/uka/ipd/sdq/pcmsolver/handler/ExternalCallActionHandler.java,> line 218: The value of the local variable returnName is not used
Warning: file <https://sdqweb.ipd.kit.edu/jenkins/job/Palladio%20Core/ws/de.uka.ipd.sdq.pcmsolver/src/de/uka/ipd/sdq/pcmsolver/handler/AbstractLoopActionHandler.java,> line 89: Sample is a raw type. References to generic type Sample<T> should be parameterized
Warning: file <https://sdqweb.ipd.kit.edu/jenkins/job/Palladio%20Core/ws/de.uka.ipd.sdq.pcmsolver/src/de/uka/ipd/sdq/pcmsolver/handler/AbstractBranchTransitionHandler.java,> line 13: The value of the field AbstractBranchTransitionHandler.logger is not used
Warning: file <https://sdqweb.ipd.kit.edu/jenkins/job/Palladio%20Core/ws/de.uka.ipd.sdq.pcmsolver/src/de/uka/ipd/sdq/pcmsolver/exprsolver/ExpressionSolver.java,> line 46: ExpressionSwitch is a raw type. References to generic type ExpressionSwitch<T> should be parameterized
Warning: file <https://sdqweb.ipd.kit.edu/jenkins/job/Palladio%20Core/ws/de.uka.ipd.sdq.pcmsolver/src/de/uka/ipd/sdq/pcmsolver/PCMSolver.java,> line 102: The constructor PCMInstance(ILaunchConfiguration) is deprecated
Warning: file <https://sdqweb.ipd.kit.edu/jenkins/job/Palladio%20Core/ws/de.uka.ipd.sdq.pcmsolver/src/de/uka/ipd/sdq/pcmsolver/DependencySolver.java,> line 65: The value of the field DependencySolver.DOMAIN_SIZE is not used
Warning: file <https://sdqweb.ipd.kit.edu/jenkins/job/Palladio%20Core/ws/de.uka.ipd.sdq.pcmsolver/src/de/uka/ipd/sdq/pcmsolver/DependencySolver.java,> line 232: The value of the local variable dsolver is not used
Warning: file <https://sdqweb.ipd.kit.edu/jenkins/job/Palladio%20Core/ws/de.uka.ipd.sdq.pcmsolver>: Build path specifies execution environment JavaSE-1.6. There are no JREs installed in the workspace that are strictly compatible with this environment. 
Warning: file <https://sdqweb.ipd.kit.edu/jenkins/job/Palladio%20Core/ws/de.uka.ipd.sdq.pcmsolver/build.properties,> line 6: resources/ is missing from source..
Warning: file <https://sdqweb.ipd.kit.edu/jenkins/job/Palladio%20Core/ws/de.uka.ipd.sdq.reliability.solver/src/de/uka/ipd/sdq/reliability/solver/visualisation/MarkovResultEditorInput.java,> line 39: Class is a raw type. References to generic type Class<T> should be parameterized
Warning: file <https://sdqweb.ipd.kit.edu/jenkins/job/Palladio%20Core/ws/de.uka.ipd.sdq.reliability.solver/src/de/uka/ipd/sdq/reliability/solver/pcm2markov/MarkovBuilder.java,> line 1015: Sample is a raw type. References to generic type Sample<T> should be parameterized
Warning: file <https://sdqweb.ipd.kit.edu/jenkins/job/Palladio%20Core/ws/de.uka.ipd.sdq.reliability.solver/src/de/uka/ipd/sdq/reliability/solver/compare/MarkovComparator.java,> line 81: The value of the field MarkovComparator.transitionChangeCount is not used
Warning: file <https://sdqweb.ipd.kit.edu/jenkins/job/Palladio%20Core/ws/de.uka.ipd.sdq.reliability.solver>: Build path specifies execution environment JavaSE-1.6. There are no JREs installed in the workspace that are strictly compatible with this environment. 
Warning: file <https://sdqweb.ipd.kit.edu/jenkins/job/Palladio%20Core/ws/de.uka.ipd.sdq.reliability.solver/plugin.xml,> line 28: Element 'objectContribution' is deprecated
Warning: file <https://sdqweb.ipd.kit.edu/jenkins/job/Palladio%20Core/ws/de.uka.ipd.sdq.reliability.solver/plugin.xml,> line 40: Element 'action' is deprecated
Warning: file <https://sdqweb.ipd.kit.edu/jenkins/job/Palladio%20Core/ws/de.uka.ipd.sdq.reliability.solver/build.properties,> line 1: resources/ is missing from source..
Warning: file <https://sdqweb.ipd.kit.edu/jenkins/job/Palladio%20Core/ws/org.jscience/src/org/jscience/physics/amount/AmountFormat.java,> line 139: Amount is a raw type. References to generic type Amount<Q> should be parameterized
Warning: file <https://sdqweb.ipd.kit.edu/jenkins/job/Palladio%20Core/ws/org.jscience/src/org/jscience/physics/amount/AmountFormat.java,> line 282: Amount is a raw type. References to generic type Amount<Q> should be parameterized
Warning: file <https://sdqweb.ipd.kit.edu/jenkins/job/Palladio%20Core/ws/org.jscience/src/org/jscience/physics/amount/Amount.java,> line 451: Amount is a raw type. References to generic type Amount<Q> should be parameterized
Warning: file <https://sdqweb.ipd.kit.edu/jenkins/job/Palladio%20Core/ws/org.jscience/src/org/jscience/physics/amount/Amount.java,> line 1011: Amount is a raw type. References to generic type Amount<Q> should be parameterized
Warning: file <https://sdqweb.ipd.kit.edu/jenkins/job/Palladio%20Core/ws/org.jscience/src/org/jscience/mathematics/vector/Vector.java,> line 193: Vector is a raw type. References to generic type Vector<F> should be parameterized
Warning: file <https://sdqweb.ipd.kit.edu/jenkins/job/Palladio%20Core/ws/org.jscience/src/org/jscience/mathematics/vector/SparseVector.java,> line 49: SparseVector is a raw type. References to generic type SparseVector<F> should be parameterized
Warning: file <https://sdqweb.ipd.kit.edu/jenkins/job/Palladio%20Core/ws/org.jscience/src/org/jscience/mathematics/vector/SparseMatrix.java,> line 106: Type safety: Potential heap pollution via varargs parameter rows
Warning: file <https://sdqweb.ipd.kit.edu/jenkins/job/Palladio%20Core/ws/org.jscience/src/org/jscience/mathematics/vector/Matrix.java,> line 89: Matrix is a raw type. References to generic type Matrix<F> should be parameterized
Warning: file <https://sdqweb.ipd.kit.edu/jenkins/job/Palladio%20Core/ws/org.jscience/src/org/jscience/mathematics/vector/Matrix.java,> line 93: Matrix is a raw type. References to generic type Matrix<F> should be parameterized
Warning: file <https://sdqweb.ipd.kit.edu/jenkins/job/Palladio%20Core/ws/org.jscience/src/org/jscience/mathematics/vector/LUDecomposition.java,> line 55: Field is a raw type. References to generic type Field<F> should be parameterized
Warning: file <https://sdqweb.ipd.kit.edu/jenkins/job/Palladio%20Core/ws/org.jscience/src/org/jscience/mathematics/vector/LUDecomposition.java,> line 400: LUDecomposition is a raw type. References to generic type LUDecomposition<F> should be parameterized
Warning: file <https://sdqweb.ipd.kit.edu/jenkins/job/Palladio%20Core/ws/org.jscience/src/org/jscience/mathematics/vector/Float64Vector.java,> line 313: The value of the field Float64Vector.serialVersionUID is not used
Warning: file <https://sdqweb.ipd.kit.edu/jenkins/job/Palladio%20Core/ws/org.jscience/src/org/jscience/mathematics/vector/Float64Matrix.java,> line 444: The value of the field Float64Matrix.serialVersionUID is not used
Warning: file <https://sdqweb.ipd.kit.edu/jenkins/job/Palladio%20Core/ws/org.jscience/src/org/jscience/mathematics/vector/DenseVector.java,> line 41: DenseVector is a raw type. References to generic type DenseVector<F> should be parameterized
Warning: file <https://sdqweb.ipd.kit.edu/jenkins/job/Palladio%20Core/ws/org.jscience/src/org/jscience/mathematics/vector/DenseVector.java,> line 213: The value of the field DenseVector<F>.serialVersionUID is not used
Warning: file <https://sdqweb.ipd.kit.edu/jenkins/job/Palladio%20Core/ws/org.jscience/src/org/jscience/mathematics/vector/DenseMatrix.java,> line 481: DenseMatrix is a raw type. References to generic type DenseMatrix<F> should be parameterized
Warning: file <https://sdqweb.ipd.kit.edu/jenkins/job/Palladio%20Core/ws/org.jscience/src/org/jscience/mathematics/vector/ComplexVector.java,> line 312: The value of the field ComplexVector.serialVersionUID is not used
Warning: file <https://sdqweb.ipd.kit.edu/jenkins/job/Palladio%20Core/ws/org.jscience/src/org/jscience/mathematics/vector/ComplexMatrix.java,> line 437: The value of the field ComplexMatrix.serialVersionUID is not used
Warning: file <https://sdqweb.ipd.kit.edu/jenkins/job/Palladio%20Core/ws/org.jscience/src/org/jscience/mathematics/structure/VectorSpaceNormed.java,> line 20: Field is a raw type. References to generic type Field<F> should be parameterized
Warning: file <https://sdqweb.ipd.kit.edu/jenkins/job/Palladio%20Core/ws/org.jscience/src/org/jscience/mathematics/structure/VectorSpace.java,> line 20: Field is a raw type. References to generic type Field<F> should be parameterized
Warning: file <https://sdqweb.ipd.kit.edu/jenkins/job/Palladio%20Core/ws/org.jscience/src/org/jscience/mathematics/number/Number.java,> line 25: The serializable class Number does not declare a static final serialVersionUID field of type long
Warning: file <https://sdqweb.ipd.kit.edu/jenkins/job/Palladio%20Core/ws/org.jscience/src/org/jscience/mathematics/function/Term.java,> line 382: Ring is a raw type. References to generic type Ring<R> should be parameterized
Warning: file <https://sdqweb.ipd.kit.edu/jenkins/job/Palladio%20Core/ws/org.jscience/src/org/jscience/mathematics/function/RationalFunction.java,> line 82: RationalFunction is a raw type. References to generic type RationalFunction<F> should be parameterized
Warning: file <https://sdqweb.ipd.kit.edu/jenkins/job/Palladio%20Core/ws/org.jscience/src/org/jscience/mathematics/function/Polynomial.java,> line 327: GroupMultiplicative is a raw type. References to generic type GroupMultiplicative<G> should be parameterized
Warning: file <https://sdqweb.ipd.kit.edu/jenkins/job/Palladio%20Core/ws/org.jscience/src/org/jscience/mathematics/function/Polynomial.java,> line 440: Polynomial is a raw type. References to generic type Polynomial<R> should be parameterized
Warning: file <https://sdqweb.ipd.kit.edu/jenkins/job/Palladio%20Core/ws/org.jscience/src/org/jscience/mathematics/function/Function.java,> line 63: The serializable class Function does not declare a static final serialVersionUID field of type long
Warning: file <https://sdqweb.ipd.kit.edu/jenkins/job/Palladio%20Core/ws/org.jscience/src/org/jscience/mathematics/function/Function.java,> line 339: Variable is a raw type. References to generic type Variable<X> should be parameterized
Warning: file <https://sdqweb.ipd.kit.edu/jenkins/job/Palladio%20Core/ws/org.jscience/src/org/jscience/mathematics/function/Function.java,> line 465: Function is a raw type. References to generic type Function<X,Y> should be parameterized
Warning: file <https://sdqweb.ipd.kit.edu/jenkins/job/Palladio%20Core/ws/org.jscience/src/org/jscience/mathematics/function/Function.java,> line 600: GroupAdditive is a raw type. References to generic type GroupAdditive<G> should be parameterized
Warning: file <https://sdqweb.ipd.kit.edu/jenkins/job/Palladio%20Core/ws/org.jscience/src/org/jscience/mathematics/function/Function.java,> line 691: Variable is a raw type. References to generic type Variable<X> should be parameterized
Warning: file <https://sdqweb.ipd.kit.edu/jenkins/job/Palladio%20Core/ws/org.jscience/src/org/jscience/mathematics/function/Function.java,> line 838: Function is a raw type. References to generic type Function<X,Y> should be parameterized
Warning: file <https://sdqweb.ipd.kit.edu/jenkins/job/Palladio%20Core/ws/org.jscience/src/org/jscience/mathematics/function/Function.java,> line 844: Function is a raw type. References to generic type Function<X,Y> should be parameterized
Warning: file <https://sdqweb.ipd.kit.edu/jenkins/job/Palladio%20Core/ws/org.jscience/src/org/jscience/mathematics/function/Constant.java,> line 43: Constant is a raw type. References to generic type Constant<R> should be parameterized
Warning: file <https://sdqweb.ipd.kit.edu/jenkins/job/Palladio%20Core/ws/org.jscience/src/org/jscience/mathematics/function/Constant.java,> line 48: Constant is a raw type. References to generic type Constant<R> should be parameterized
Warning: file <https://sdqweb.ipd.kit.edu/jenkins/job/Palladio%20Core/ws/org.jscience/src/org/jscience/geography/coordinates/Coordinates.java,> line 30: The serializable class Coordinates does not declare a static final serialVersionUID field of type long
Warning: file <https://sdqweb.ipd.kit.edu/jenkins/job/Palladio%20Core/ws/org.jscience/src/org/jscience/geography/coordinates/CompoundCoordinates.java,> line 57: CompoundCoordinates is a raw type. References to generic type CompoundCoordinates<C1,C2> should be parameterized
Warning: file <https://sdqweb.ipd.kit.edu/jenkins/job/Palladio%20Core/ws/org.jscience/src/org/jscience/geography/coordinates/CompoundCoordinates.java,> line 133: CompoundCoordinates is a raw type. References to generic type CompoundCoordinates<C1,C2> should be parameterized
Warning: file <https://sdqweb.ipd.kit.edu/jenkins/job/Palladio%20Core/ws/org.jscience/src/javax/measure/unit/UnitFormat.java,> line 378: Unit is a raw type. References to generic type Unit<Q> should be parameterized
Warning: file <https://sdqweb.ipd.kit.edu/jenkins/job/Palladio%20Core/ws/org.jscience/src/javax/measure/unit/Unit.java,> line 55: The serializable class Unit does not declare a static final serialVersionUID field of type long
Warning: file <https://sdqweb.ipd.kit.edu/jenkins/job/Palladio%20Core/ws/org.jscience/src/javax/measure/unit/ProductUnit.java,> line 342: Unit is a raw type. References to generic type Unit<Q> should be parameterized
Warning: file <https://sdqweb.ipd.kit.edu/jenkins/job/Palladio%20Core/ws/org.jscience/src/javax/measure/unit/DerivedUnit.java,> line 20: The serializable class DerivedUnit does not declare a static final serialVersionUID field of type long
Warning: file <https://sdqweb.ipd.kit.edu/jenkins/job/Palladio%20Core/ws/org.jscience/src/javax/measure/converter/UnitConverter.java,> line 27: The serializable class UnitConverter does not declare a static final serialVersionUID field of type long
Warning: file <https://sdqweb.ipd.kit.edu/jenkins/job/Palladio%20Core/ws/org.jscience/src/javax/measure/VectorMeasure.java,> line 45: The serializable class VectorMeasure does not declare a static final serialVersionUID field of type long
Warning: file <https://sdqweb.ipd.kit.edu/jenkins/job/Palladio%20Core/ws/org.jscience/src/javax/measure/MeasureFormat.java,> line 142: Measure is a raw type. References to generic type Measure<V,Q> should be parameterized
Warning: file <https://sdqweb.ipd.kit.edu/jenkins/job/Palladio%20Core/ws/org.jscience/src/javax/measure/MeasureFormat.java,> line 151: Unit is a raw type. References to generic type Unit<Q> should be parameterized
Warning: file <https://sdqweb.ipd.kit.edu/jenkins/job/Palladio%20Core/ws/org.jscience/src/javax/measure/Measure.java,> line 193: Unnecessary @SuppressWarnings("unchecked")
Warning: file <https://sdqweb.ipd.kit.edu/jenkins/job/Palladio%20Core/ws/org.jscience/src/javax/measure/DecimalMeasure.java,> line 96: Unit is a raw type. References to generic type Unit<Q> should be parameterized
Warning: file <https://sdqweb.ipd.kit.edu/jenkins/job/Palladio%20Core/ws/org.jscience>: Build path specifies execution environment JavaSE-1.6. There are no JREs installed in the workspace that are strictly compatible with this environment. 
Warning: file <https://sdqweb.ipd.kit.edu/jenkins/job/Palladio%20Core/ws/org.jscience/build.properties,> line 4: The file "plugin.xml" does not exist in the workspace
Warning: file <https://sdqweb.ipd.kit.edu/jenkins/job/Palladio%20Core/ws/de.uka.ipd.sdq.simucomframework/src/de/uka/ipd/sdq/simucomframework/calculator/SetupPipesAndFiltersStrategy.java,> line 24: The value of the field SetupPipesAndFiltersStrategy.logger is not used
Warning: file <https://sdqweb.ipd.kit.edu/jenkins/job/Palladio%20Core/ws/de.uka.ipd.sdq.simucomframework>: Build path specifies execution environment JavaSE-1.6. There are no JREs installed in the workspace that are strictly compatible with this environment. 
Warning: file <https://sdqweb.ipd.kit.edu/jenkins/job/Palladio%20Core/ws/de.uka.ipd.sdq.simucomframework.variables.tests>: Build path specifies execution environment JavaSE-1.6. There are no JREs installed in the workspace that are strictly compatible with this environment. 
Warning: file <https://sdqweb.ipd.kit.edu/jenkins/job/Palladio%20Core/ws/de.uka.ipd.sdq.codegen.simucontroller.tests>: Build path specifies execution environment JavaSE-1.6. There are no JREs installed in the workspace that are strictly compatible with this environment. 
Warning: file <https://sdqweb.ipd.kit.edu/jenkins/job/Palladio%20Core/ws/de.uka.ipd.sdq.simucomframework.simulationdock/src/de/uka/ipd/sdq/simucomframework/simulationdock/SimulationProgressReportingObserver.java,> line 41: Type safety: The expression of type Map needs unchecked conversion to conform to Map<String,?>
Warning: file <https://sdqweb.ipd.kit.edu/jenkins/job/Palladio%20Core/ws/de.uka.ipd.sdq.simucomframework.simulationdock/src/de/uka/ipd/sdq/simucomframework/simulationdock/SimulationDockServiceImpl.java,> line 37: ServiceTracker is a raw type. References to generic type ServiceTracker<S,T> should be parameterized
Warning: file <https://sdqweb.ipd.kit.edu/jenkins/job/Palladio%20Core/ws/de.uka.ipd.sdq.simucomframework.simulationdock/src/de/uka/ipd/sdq/simucomframework/simulationdock/SimulationDockServiceImpl.java,> line 114: ServiceTracker is a raw type. References to generic type ServiceTracker<S,T> should be parameterized
Warning: file <https://sdqweb.ipd.kit.edu/jenkins/job/Palladio%20Core/ws/de.uka.ipd.sdq.simucomframework.simulationdock/src/de/uka/ipd/sdq/simucomframework/simulationdock/DebugObserver.java,> line 94: Map is a raw type. References to generic type Map<K,V> should be parameterized
Warning: file <https://sdqweb.ipd.kit.edu/jenkins/job/Palladio%20Core/ws/de.uka.ipd.sdq.simucomframework.simulationdock/src/de/uka/ipd/sdq/simucomframework/simulationdock/Activator.java,> line 29: Type safety: The expression of type Hashtable needs unchecked conversion to conform to Dictionary<String,?>
Warning: file <https://sdqweb.ipd.kit.edu/jenkins/job/Palladio%20Core/ws/de.uka.ipd.sdq.simucomframework.simulationdock>: Build path specifies execution environment JavaSE-1.6. There are no JREs installed in the workspace that are strictly compatible with this environment. 
Warning: file <https://sdqweb.ipd.kit.edu/jenkins/job/Palladio%20Core/ws/de.uka.ipd.sdq.codegen.simucontroller/src/de/uka/ipd/sdq/pcm/transformations/AllInstancesTransformer.java,> line 29: OCL is a raw type. References to generic type OCL<PK,C,O,P,EL,PM,S,COA,SSA,CT,CLS,E> should be parameterized
Warning: file <https://sdqweb.ipd.kit.edu/jenkins/job/Palladio%20Core/ws/de.uka.ipd.sdq.codegen.simucontroller/src/de/uka/ipd/sdq/codegen/simucontroller/runconfig/SimuComWorkflowLauncher.java,> line 37: Type safety: The expression of type Map needs unchecked conversion to conform to Map<String,Object>
Warning: file <https://sdqweb.ipd.kit.edu/jenkins/job/Palladio%20Core/ws/de.uka.ipd.sdq.codegen.simucontroller/src/de/uka/ipd/sdq/codegen/simucontroller/runconfig/FeatureOptionsTab.java,> line 113: The value of the local variable checkListener is not used
Warning: file <https://sdqweb.ipd.kit.edu/jenkins/job/Palladio%20Core/ws/de.uka.ipd.sdq.codegen.simucontroller/src/de/uka/ipd/sdq/codegen/simucontroller/dockmodel/DocksModel.java,> line 137: ServiceTracker is a raw type. References to generic type ServiceTracker<S,T> should be parameterized
Warning: file <https://sdqweb.ipd.kit.edu/jenkins/job/Palladio%20Core/ws/de.uka.ipd.sdq.codegen.simucontroller/src/de/uka/ipd/sdq/codegen/simucontroller/dockmodel/DocksModel.java,> line 226: Type safety: The expression of type ServiceReference needs unchecked conversion to conform to ServiceReference<Object>
Warning: file <https://sdqweb.ipd.kit.edu/jenkins/job/Palladio%20Core/ws/de.uka.ipd.sdq.codegen.simucontroller/src/de/uka/ipd/sdq/codegen/simucontroller/debug/SimulationDebugElement.java,> line 57: Unnecessary @SuppressWarnings("unchecked")
Warning: file <https://sdqweb.ipd.kit.edu/jenkins/job/Palladio%20Core/ws/de.uka.ipd.sdq.codegen.simucontroller>: Build path specifies execution environment JavaSE-1.6. There are no JREs installed in the workspace that are strictly compatible with this environment. 
Warning: file <https://sdqweb.ipd.kit.edu/jenkins/job/Palladio%20Core/ws/org.palladiosimulator.protocom.resourcestrategies/src/org/palladiosimulator/protocom/resourcestrategies/activeresource/CalibrationTable.java,> line 145: Resource leak: 'o' is never closed
Warning: file <https://sdqweb.ipd.kit.edu/jenkins/job/Palladio%20Core/ws/org.palladiosimulator.protocom.resourcestrategies/src/org/palladiosimulator/protocom/resourcestrategies/activeresource/AbstractDemandStrategy.java,> line 317: Type safety: The expression of type Amount[] needs unchecked conversion to conform to Amount<Duration>[]
Warning: file <https://sdqweb.ipd.kit.edu/jenkins/job/Palladio%20Core/ws/org.palladiosimulator.protocom.framework/src/org/palladiosimulator/protocom/framework/utils/RunProperties.java,> line 125: The method getOptionObject(String) from the type CommandLine is deprecated
Warning: file <https://sdqweb.ipd.kit.edu/jenkins/job/Palladio%20Core/ws/org.palladiosimulator.protocom.framework/src/org/palladiosimulator/protocom/framework/registry/RmiRegistry.java,> line 268: Resource leak: 'input' is never closed
Warning: file <https://sdqweb.ipd.kit.edu/jenkins/job/Palladio%20Core/ws/org.palladiosimulator.protocom.framework>: Build path specifies execution environment JavaSE-1.6. There are no JREs installed in the workspace that are strictly compatible with this environment. 
Warning: file <https://sdqweb.ipd.kit.edu/jenkins/job/Palladio%20Core/ws/org.palladiosimulator.protocom.framework.tests/src/org/palladiosimulator/protocom/framework/tests/PrototypePlatformTests.java,> line 34: The method getRoot() from the type Category is deprecated
Warning: file <https://sdqweb.ipd.kit.edu/jenkins/job/Palladio%20Core/ws/org.palladiosimulator.protocom.framework.tests/src/org/palladiosimulator/protocom/framework/tests/PassiveResourcesTest.java,> line 66: The method assertTrue(boolean) from the type Assert is deprecated
Warning: file <https://sdqweb.ipd.kit.edu/jenkins/job/Palladio%20Core/ws/org.palladiosimulator.protocom.framework.tests>: Build path specifies execution environment JavaSE-1.6. There are no JREs installed in the workspace that are strictly compatible with this environment. 
Warning: file <https://sdqweb.ipd.kit.edu/jenkins/job/Palladio%20Core/ws/org.palladiosimulator.protocom.workflow>: Build path specifies execution environment JavaSE-1.6. There are no JREs installed in the workspace that are strictly compatible with this environment. 
Warning: file <https://sdqweb.ipd.kit.edu/jenkins/job/Palladio%20Core/ws/org.palladiosimulator.protocom.feature/feature.xml,> line 255: Feature reference 'org.eclipse.xtend.sdk' cannot be resolved
Found 898 warnings
Checking for Buckminster Updates
[Buckminster_4.3] $ /var/lib/jenkins/tools/hudson.plugins.buckminster.BuckminsterInstallation/Buckminster_4.3/director/director -vm /var/lib/jenkins/tools/hudson.model.JDK/JDK_1.6/bin/java -d /var/lib/jenkins/tools/hudson.plugins.buckminster.BuckminsterInstallation/Buckminster_4.3/buckminster -p Buckminster -r "http://download.eclipse.org/tools/buckminster/headless-4.3, http://download.cloudsmith.com/buckminster/external-4.3" -uninstallIU "org.eclipse.buckminster.emma.headless.feature.feature.group, org.eclipse.buckminster.pde.headless.feature.feature.group, org.eclipse.buckminster.subclipse.headless.feature.feature.group, org.eclipse.buckminster.maven.headless.feature.feature.group, org.eclipse.buckminster.core.headless.feature.feature.group, org.eclipse.buckminster.git.headless.feature.feature.group, org.eclipse.buckminster.cvs.headless.feature.feature.group" -installIU "org.eclipse.buckminster.emma.headless.feature.feature.group, org.eclipse.buckminster.pde.headless.feature.feature.group, org.eclipse.buckminster.subclipse.headless.feature.feature.group, org.eclipse.buckminster.maven.headless.feature.feature.group, org.eclipse.buckminster.core.headless.feature.feature.group, org.eclipse.buckminster.git.headless.feature.feature.group, org.eclipse.buckminster.cvs.headless.feature.feature.group"
Installing org.eclipse.buckminster.emma.headless.feature.feature.group 1.6.0.v20130317-0829.
Installing org.eclipse.buckminster.pde.headless.feature.feature.group 1.6.0.v20131111-2111.
Installing org.eclipse.buckminster.subclipse.headless.feature.feature.group 1.6.0.v20130317-0829.
Installing org.eclipse.buckminster.maven.headless.feature.feature.group 1.6.0.v20130317-0829.
Installing org.eclipse.buckminster.core.headless.feature.feature.group 1.6.0.v20131003-1606.
Installing org.eclipse.buckminster.git.headless.feature.feature.group 1.6.0.v20130614-0659.
Installing org.eclipse.buckminster.cvs.headless.feature.feature.group 1.6.0.v20130317-0829.
Uninstalling org.eclipse.buckminster.emma.headless.feature.feature.group 1.6.0.v20130317-0829.
Uninstalling org.eclipse.buckminster.pde.headless.feature.feature.group 1.6.0.v20131111-2111.
Uninstalling org.eclipse.buckminster.subclipse.headless.feature.feature.group 1.6.0.v20130317-0829.
Uninstalling org.eclipse.buckminster.maven.headless.feature.feature.group 1.6.0.v20130317-0829.
Uninstalling org.eclipse.buckminster.core.headless.feature.feature.group 1.6.0.v20131003-1606.
Uninstalling org.eclipse.buckminster.git.headless.feature.feature.group 1.6.0.v20130614-0659.
Uninstalling org.eclipse.buckminster.cvs.headless.feature.feature.group 1.6.0.v20130317-0829.
Operation completed in 4739 ms.
[workspace] $ /var/lib/jenkins/tools/hudson.model.JDK/JDK_1.7/bin/java "-Dbuckminster.output.root=<https://sdqweb.ipd.kit.edu/jenkins/job/Palladio%20Core/ws/buckminster.output"> "-Dbuckminster.temp.root=<https://sdqweb.ipd.kit.edu/jenkins/job/Palladio%20Core/ws/buckminster.temp"> -Xmx512m -jar /var/lib/jenkins/tools/hudson.plugins.buckminster.BuckminsterInstallation/Buckminster_4.3/buckminster/plugins/org.eclipse.equinox.launcher_1.3.0.v20130327-1440.jar -application org.eclipse.buckminster.cmdline.headless -data "<https://sdqweb.ipd.kit.edu/jenkins/job/Palladio%20Core/ws/"> --loglevel info -S "<https://sdqweb.ipd.kit.edu/jenkins/job/Palladio%20Core/ws/build_command.txt">
INFO:  emma '-m' '-l' 'de.uka.ipd.sdq.pcm.stochasticexpressions.tests/de.uka.ipd.sdq.pcm.stochasticexpressions.tests.launch' '-o' 'output/junit/de.uka.ipd.sdq.pcm.stochasticexpressions.tests#de.uka.ipd.sdq.pcm.stochasticexpressions.tests.launch.xml' '--xml' 'output/emma/coverage.xml'
INFO:  Starting test session de.uka.ipd.sdq.pcm.stochasticexpressions.tests
INFO:  Running test de.uka.ipd.sdq.pcm.stochasticexpressions.tests.TypeInferTests.testTypeInfererBool...
INFO:    ...OK [2.196s]
INFO:  Running test de.uka.ipd.sdq.pcm.stochasticexpressions.tests.TypeInferTests.testsubInfer...
INFO:    ...OK [0.007s]
INFO:  Running test de.uka.ipd.sdq.pcm.stochasticexpressions.tests.TypeInferTests.testSubFuncInfer...
INFO:    ...OK [0.005s]
INFO:  Running test de.uka.ipd.sdq.pcm.stochasticexpressions.tests.TypeInferTests.testEnums...
INFO:    ...OK [0.017s]
INFO:  Running test de.uka.ipd.sdq.pcm.stochasticexpressions.tests.TypeInferTests.testDoubleAnyCompare...
INFO:    ...OK [0.926s]
INFO:  Running test de.uka.ipd.sdq.pcm.stochasticexpressions.tests.TypeInferTests.testDoubleAnyCompareIfElse...
INFO:    ...OK [0.003s]
INFO:  Running test de.uka.ipd.sdq.pcm.stochasticexpressions.tests.TypeInferTests.testTenaryOp...
INFO:    ...OK [0.005s]
INFO:  Running test de.uka.ipd.sdq.pcm.stochasticexpressions.tests.TypeInferTests.testParenthesis...
INFO:    ...OK [0.004s]
INFO:  Running test de.uka.ipd.sdq.pcm.stochasticexpressions.tests.TypeInferTests.testVariables...
INFO:    ...OK [0.002s]
INFO:  Running test de.uka.ipd.sdq.pcm.stochasticexpressions.tests.TypeInferTests.testIntPMF...
INFO:    ...OK [0.003s]
INFO:  Running test de.uka.ipd.sdq.pcm.stochasticexpressions.tests.TypeInferTests.testNegativeDoublePDF...
INFO:    ...OK [0.012s]
INFO:  Tests finished.
INFO:  Elapsed time: 3.193 seconds.
INFO:  Total number of tests executed: 11
INFO:  Successful tests: 11
INFO:  Failed tests: 0
INFO:  Errors: 0
INFO:  Ignored tests: 0
INFO:  Overall status: OK
ERROR: No coverage has been collected during coverage launch (code 5101).
Error while exporting coverage session (code 5008).
Caused by: java.io.FileNotFoundException: output/emma/coverage.xml (No such file or directory)
Build step 'Run Buckminster' marked build as failure
Xvfb stopping
[CHECKSTYLE] Skipping publisher since build result is FAILURE
Recording test results
Using svn credentials...
Using svn credentials...
Using svn credentials...
Using svn credentials...
Using svn credentials...
Using svn credentials...
Using svn credentials...
Using svn credentials...
Using svn credentials...
Using svn credentials...
Using svn credentials...
Using svn credentials...
Using svn credentials...
Using svn credentials...
Emma: looking for coverage reports in the provided path: output/emma/coverage.xml
SSH: Current build result is [FAILURE], not going to run.



More information about the palladio-dev mailing list