[palladio-dev] Build failed in Jenkins: EDP2 #6

webmaster-sdq at ipd.uka.de webmaster-sdq at ipd.uka.de
Fri Mar 7 10:34:09 CET 2014


See <https://sdqweb.ipd.kit.edu/jenkins/job/EDP2/6/>

------------------------------------------
Started by user Steffen Becker
Building in workspace <https://sdqweb.ipd.kit.edu/jenkins/job/EDP2/ws/>
Updating https://svnserver.informatik.kit.edu/i43/svn/code/EDP2 at revision '2014-03-07T10:33:17.668 +0100'
At revision 21067
Updating https://svnserver.informatik.kit.edu/i43/svn/code/Development/de.uka.ipd.sdq.codeconventions at revision '2014-03-07T10:33:17.668 +0100'
At revision 21067
Checking out a fresh workspace because there's no workspace at <https://sdqweb.ipd.kit.edu/jenkins/job/EDP2/ws/>
Cleaning local Directory .
Checking out https://svnserver.informatik.kit.edu/i43/svn/code/ThirdPartyWrapper/trunk/org.jfree.jfreechart at revision '2014-03-07T10:33:17.668 +0100'
A         .classpath
A         META-INF
A         META-INF/MANIFEST.MF
AU        jcommon-1.0.12.zip
AU        jfreechart-1.0.9.zip
A         .project
AU        jfreechart-1.0.9-swt.jar
AU        jfreechart-1.0.9-javadocs.zip
A         build.properties
AU        jcommon-1.0.12.jar
AU        jfreechart-1.0.9.jar
A         about_files
A         about_files/JCOMMON-LICENSE.TXT
A         about_files/JFREECHART-SWT-LICENSE.TXT
A         about_files/JFREECHART-LICENSE.TXT
AU        about.html
At revision 21067
ERROR: Failed to parse svn info for https://svnserver.informatik.kit.edu/i43/svn/code/EDP2
org.tmatesoft.svn.core.SVNException: svn: E200005: '<https://sdqweb.ipd.kit.edu/jenkins/job/EDP2/ws/EDP2'> is not under version control
	at org.tmatesoft.svn.core.internal.wc.SVNErrorManager.error(SVNErrorManager.java:64)
	at org.tmatesoft.svn.core.internal.wc.SVNErrorManager.error(SVNErrorManager.java:51)
	at org.tmatesoft.svn.core.internal.wc16.SVNWCClient16$12.handleError(SVNWCClient16.java:3456)
	at org.tmatesoft.svn.core.internal.wc.admin.SVNWCAccess.walkEntries(SVNWCAccess.java:774)
	at org.tmatesoft.svn.core.internal.wc.admin.SVNWCAccess.walkEntries(SVNWCAccess.java:757)
	at org.tmatesoft.svn.core.internal.wc16.SVNWCClient16.crawlEntries(SVNWCClient16.java:3433)
	at org.tmatesoft.svn.core.internal.wc16.SVNWCClient16.doInfo(SVNWCClient16.java:2645)
	at org.tmatesoft.svn.core.internal.wc2.old.SvnOldGetInfo.run(SvnOldGetInfo.java:18)
	at org.tmatesoft.svn.core.internal.wc2.old.SvnOldGetInfo.run(SvnOldGetInfo.java:12)
	at org.tmatesoft.svn.core.internal.wc2.SvnOperationRunner.run(SvnOperationRunner.java:20)
	at org.tmatesoft.svn.core.wc2.SvnOperationFactory.run(SvnOperationFactory.java:1238)
	at org.tmatesoft.svn.core.wc2.SvnOperation.run(SvnOperation.java:294)
	at org.tmatesoft.svn.core.wc.SVNWCClient.doInfo(SVNWCClient.java:2423)
	at hudson.scm.SubversionSCM$BuildRevisionMapTask.invoke(SubversionSCM.java:1164)
	at hudson.scm.SubversionSCM$BuildRevisionMapTask.invoke(SubversionSCM.java:1142)
	at hudson.FilePath.act(FilePath.java:914)
	at hudson.FilePath.act(FilePath.java:887)
	at hudson.scm.SubversionSCM.checkout(SubversionSCM.java:796)
	at hudson.model.AbstractProject.checkout(AbstractProject.java:1411)
	at hudson.model.AbstractBuild$AbstractBuildExecution.defaultCheckout(AbstractBuild.java:651)
	at jenkins.scm.SCMCheckoutStrategy.checkout(SCMCheckoutStrategy.java:88)
	at hudson.model.AbstractBuild$AbstractBuildExecution.run(AbstractBuild.java:560)
	at hudson.model.Run.execute(Run.java:1670)
	at hudson.model.FreeStyleBuild.run(FreeStyleBuild.java:46)
	at hudson.model.ResourceController.execute(ResourceController.java:88)
	at hudson.model.Executor.run(Executor.java:231)
Caused by: svn: E200005: '<https://sdqweb.ipd.kit.edu/jenkins/job/EDP2/ws/EDP2'> is not under version control
	at org.tmatesoft.svn.core.SVNErrorMessage.create(SVNErrorMessage.java:171)
	at org.tmatesoft.svn.core.SVNErrorMessage.create(SVNErrorMessage.java:126)
	... 23 more
ERROR: Failed to parse svn info for https://svnserver.informatik.kit.edu/i43/svn/code/Development/de.uka.ipd.sdq.codeconventions
org.tmatesoft.svn.core.SVNException: svn: E200005: '<https://sdqweb.ipd.kit.edu/jenkins/job/EDP2/ws/de.uka.ipd.sdq.codeconventions'> is not under version control
	at org.tmatesoft.svn.core.internal.wc.SVNErrorManager.error(SVNErrorManager.java:64)
	at org.tmatesoft.svn.core.internal.wc.SVNErrorManager.error(SVNErrorManager.java:51)
	at org.tmatesoft.svn.core.internal.wc16.SVNWCClient16$12.handleError(SVNWCClient16.java:3456)
	at org.tmatesoft.svn.core.internal.wc.admin.SVNWCAccess.walkEntries(SVNWCAccess.java:774)
	at org.tmatesoft.svn.core.internal.wc.admin.SVNWCAccess.walkEntries(SVNWCAccess.java:757)
	at org.tmatesoft.svn.core.internal.wc16.SVNWCClient16.crawlEntries(SVNWCClient16.java:3433)
	at org.tmatesoft.svn.core.internal.wc16.SVNWCClient16.doInfo(SVNWCClient16.java:2645)
	at org.tmatesoft.svn.core.internal.wc2.old.SvnOldGetInfo.run(SvnOldGetInfo.java:18)
	at org.tmatesoft.svn.core.internal.wc2.old.SvnOldGetInfo.run(SvnOldGetInfo.java:12)
	at org.tmatesoft.svn.core.internal.wc2.SvnOperationRunner.run(SvnOperationRunner.java:20)
	at org.tmatesoft.svn.core.wc2.SvnOperationFactory.run(SvnOperationFactory.java:1238)
	at org.tmatesoft.svn.core.wc2.SvnOperation.run(SvnOperation.java:294)
	at org.tmatesoft.svn.core.wc.SVNWCClient.doInfo(SVNWCClient.java:2423)
	at hudson.scm.SubversionSCM$BuildRevisionMapTask.invoke(SubversionSCM.java:1164)
	at hudson.scm.SubversionSCM$BuildRevisionMapTask.invoke(SubversionSCM.java:1142)
	at hudson.FilePath.act(FilePath.java:914)
	at hudson.FilePath.act(FilePath.java:887)
	at hudson.scm.SubversionSCM.checkout(SubversionSCM.java:796)
	at hudson.model.AbstractProject.checkout(AbstractProject.java:1411)
	at hudson.model.AbstractBuild$AbstractBuildExecution.defaultCheckout(AbstractBuild.java:651)
	at jenkins.scm.SCMCheckoutStrategy.checkout(SCMCheckoutStrategy.java:88)
	at hudson.model.AbstractBuild$AbstractBuildExecution.run(AbstractBuild.java:560)
	at hudson.model.Run.execute(Run.java:1670)
	at hudson.model.FreeStyleBuild.run(FreeStyleBuild.java:46)
	at hudson.model.ResourceController.execute(ResourceController.java:88)
	at hudson.model.Executor.run(Executor.java:231)
Caused by: svn: E200005: '<https://sdqweb.ipd.kit.edu/jenkins/job/EDP2/ws/de.uka.ipd.sdq.codeconventions'> is not under version control
	at org.tmatesoft.svn.core.SVNErrorMessage.create(SVNErrorMessage.java:171)
	at org.tmatesoft.svn.core.SVNErrorMessage.create(SVNErrorMessage.java:126)
	... 23 more
ERROR: No revision found for URL: https://svnserver.informatik.kit.edu/i43/svn/code/EDP2 in /var/lib/jenkins/jobs/EDP2/builds/2014-03-07_10-33-17/revision.txt. Revision file contains: [https://svnserver.informatik.kit.edu/i43/svn/code/ThirdPartyWrapper/trunk/org.jfree.jfreechart]
ERROR: No revision found for URL: https://svnserver.informatik.kit.edu/i43/svn/code/Development/de.uka.ipd.sdq.codeconventions in /var/lib/jenkins/jobs/EDP2/builds/2014-03-07_10-33-17/revision.txt. Revision file contains: [https://svnserver.informatik.kit.edu/i43/svn/code/ThirdPartyWrapper/trunk/org.jfree.jfreechart]
no revision recorded for https://svnserver.informatik.kit.edu/i43/svn/code/ThirdPartyWrapper/trunk/org.jfree.jfreechart in the previous build
Xvfb starting$ /usr/bin/Xvfb :3 -screen 0 1024x768x24 -fbdir /var/lib/jenkins/2014-03-07_10-33-171581824974289963189xvfb
[workspace] $ /bin/sh -xe /tmp/hudson6065673165399389937.sh
+ '[' -d buckminster.output ']'
+ '[' -d output ']'
Checking for Buckminster Updates
[Buckminster_4.3] $ /var/lib/jenkins/tools/hudson.plugins.buckminster.BuckminsterInstallation/Buckminster_4.3/director/director -vm /var/lib/jenkins/tools/hudson.model.JDK/JDK_1.6/bin/java -d /var/lib/jenkins/tools/hudson.plugins.buckminster.BuckminsterInstallation/Buckminster_4.3/buckminster -p Buckminster -r "http://download.eclipse.org/tools/buckminster/headless-4.3, http://download.cloudsmith.com/buckminster/external-4.3" -uninstallIU "org.eclipse.buckminster.emma.headless.feature.feature.group, org.eclipse.buckminster.pde.headless.feature.feature.group, org.eclipse.buckminster.subclipse.headless.feature.feature.group, org.eclipse.buckminster.maven.headless.feature.feature.group, org.eclipse.buckminster.core.headless.feature.feature.group, org.eclipse.buckminster.git.headless.feature.feature.group, org.eclipse.buckminster.cvs.headless.feature.feature.group" -installIU "org.eclipse.buckminster.emma.headless.feature.feature.group, org.eclipse.buckminster.pde.headless.feature.feature.group, org.eclipse.buckminster.subclipse.headless.feature.feature.group, org.eclipse.buckminster.maven.headless.feature.feature.group, org.eclipse.buckminster.core.headless.feature.feature.group, org.eclipse.buckminster.git.headless.feature.feature.group, org.eclipse.buckminster.cvs.headless.feature.feature.group"
Installing org.eclipse.buckminster.emma.headless.feature.feature.group 1.6.0.v20130317-0829.
Installing org.eclipse.buckminster.pde.headless.feature.feature.group 1.6.0.v20131111-2111.
Installing org.eclipse.buckminster.subclipse.headless.feature.feature.group 1.6.0.v20130317-0829.
Installing org.eclipse.buckminster.maven.headless.feature.feature.group 1.6.0.v20130317-0829.
Installing org.eclipse.buckminster.core.headless.feature.feature.group 1.6.0.v20131003-1606.
Installing org.eclipse.buckminster.git.headless.feature.feature.group 1.6.0.v20130614-0659.
Installing org.eclipse.buckminster.cvs.headless.feature.feature.group 1.6.0.v20130317-0829.
Uninstalling org.eclipse.buckminster.emma.headless.feature.feature.group 1.6.0.v20130317-0829.
Uninstalling org.eclipse.buckminster.pde.headless.feature.feature.group 1.6.0.v20131111-2111.
Uninstalling org.eclipse.buckminster.subclipse.headless.feature.feature.group 1.6.0.v20130317-0829.
Uninstalling org.eclipse.buckminster.maven.headless.feature.feature.group 1.6.0.v20130317-0829.
Uninstalling org.eclipse.buckminster.core.headless.feature.feature.group 1.6.0.v20131003-1606.
Uninstalling org.eclipse.buckminster.git.headless.feature.feature.group 1.6.0.v20130614-0659.
Uninstalling org.eclipse.buckminster.cvs.headless.feature.feature.group 1.6.0.v20130317-0829.
Operation completed in 4296 ms.
[workspace] $ /var/lib/jenkins/tools/hudson.model.JDK/JDK_1.7/bin/java -Dbuckminster.output.root=<https://sdqweb.ipd.kit.edu/jenkins/job/EDP2/ws/buckminster.output> -Dbuckminster.temp.root=<https://sdqweb.ipd.kit.edu/jenkins/job/EDP2/ws/buckminster.temp> -Xmx512m -jar /var/lib/jenkins/tools/hudson.plugins.buckminster.BuckminsterInstallation/Buckminster_4.3/buckminster/plugins/org.eclipse.equinox.launcher_1.3.0.v20130327-1440.jar -application org.eclipse.buckminster.cmdline.headless -data <https://sdqweb.ipd.kit.edu/jenkins/job/EDP2/ws/> --loglevel info -S <https://sdqweb.ipd.kit.edu/jenkins/job/EDP2/ws/commands.txt>
INFO:  setpref 'org.eclipse.buckminster.pde.targetPlatformPath=/var/lib/jenkins/eclipse/instances/edp2-kepler-modelling-sr1/'
INFO:  import 'https://anonymous:anonymous@svnserver.informatik.kit.edu/i43/svn/code/EDP2/trunk/org.palladiosimulator.edp2.buckminster/edp2.cquery'
ERROR   [0006] : No suitable provider for component org.jfree.jfreechart:osgi.bundle/1.0.9 was found in resourceMap https://anonymous:anonymous@svnserver.informatik.kit.edu/i43/svn/code/EDP2/trunk/org.palladiosimulator.edp2.buckminster/edp2.rmap
  ERROR   [0006] : No suitable provider for component org.jfree.jfreechart:osgi.bundle/1.0.9 was found in searchPath localresources
    ERROR   [0006] : Resolution attempt ended with exception: Provider local(file:///<https://sdqweb.ipd.kit.edu/jenkins/job/EDP2/ws/org.jfree.jfreechart/)>: Missing CSpec source required by component type osgi.bundle
      ERROR   Provider local(file:///<https://sdqweb.ipd.kit.edu/jenkins/job/EDP2/ws/org.jfree.jfreechart/)>: Missing CSpec source required by component type osgi.bundle
  ERROR   [0006] : No suitable provider for component org.jfree.jfreechart:osgi.bundle/1.0.9 was found in searchPath thirdpartysvn
    ERROR   [0006] : Resolution attempt ended with exception: org.tigris.subversion.svnclientadapter.SVNClientException: org.apache.subversion.javahl.ClientException: svn: E160013: URL 'https://svnserver.informatik.kit.edu/i43/svn/code/ThirdPartyWrapper/trunk/org.jfree.jfreechart' non-existent in that revision
      ERROR   org.tigris.subversion.svnclientadapter.SVNClientException: org.apache.subversion.javahl.ClientException: svn: E160013: URL 'https://svnserver.informatik.kit.edu/i43/svn/code/ThirdPartyWrapper/trunk/org.jfree.jfreechart' non-existent in that revision
  ERROR   [0006] : No suitable provider for component org.jfree.jfreechart:osgi.bundle/1.0.9 was found in searchPath orbit
    ERROR   [0006] : Rejecting provider p2(http://download.eclipse.org/tools/orbit/downloads/drops/R20130827064939/repository/[http://download.eclipse.org/tools/orbit/downloads/drops/R20130827064939/repository/]): No component match was found
INFO:  TAG-ID 0006 = Query for org.palladiosimulator.edp2.buckminster:eclipse.feature, path: org.palladiosimulator.edp2.buckminster:eclipse.feature$1.0.0.qualifier -> org.palladiosimulator.edp2.ui.feature:eclipse.feature$1.0.0.qualifier -> org.palladiosimulator.edp2.ui:osgi.bundle$1.0.0.qualifier

Build step 'Run Buckminster' marked build as failure
Xvfb stopping
[CHECKSTYLE] Skipping publisher since build result is FAILURE



More information about the palladio-dev mailing list