[palladio-dev] Build failed in Jenkins: EDP2 #7

webmaster-sdq at ipd.uka.de webmaster-sdq at ipd.uka.de
Fri Mar 7 10:38:07 CET 2014


See <https://sdqweb.ipd.kit.edu/jenkins/job/EDP2/7/>

------------------------------------------
Started by user Steffen Becker
Building in workspace <https://sdqweb.ipd.kit.edu/jenkins/job/EDP2/ws/>
Checking out a fresh workspace because <https://sdqweb.ipd.kit.edu/jenkins/job/EDP2/ws/EDP2> doesn't exist
Cleaning local Directory EDP2
Checking out https://svnserver.informatik.kit.edu/i43/svn/code/EDP2 at revision '2014-03-07T10:36:59.594 +0100'
At revision 21067
Checking out a fresh workspace because <https://sdqweb.ipd.kit.edu/jenkins/job/EDP2/ws/de.uka.ipd.sdq.codeconventions> doesn't exist
Cleaning local Directory de.uka.ipd.sdq.codeconventions
Checking out https://svnserver.informatik.kit.edu/i43/svn/code/Development/de.uka.ipd.sdq.codeconventions at revision '2014-03-07T10:36:59.594 +0100'
AU        palladio-cleanup-rules.xml
A         .project
A         palladio-checkstyle-rules.xml
AU        readme.txt
AU        palladio-code-formatter.xml
At revision 21067
Checking out a fresh workspace because <https://sdqweb.ipd.kit.edu/jenkins/job/EDP2/ws/org.jfree.jfreechart> doesn't exist
Cleaning local Directory org.jfree.jfreechart
Checking out https://svnserver.informatik.kit.edu/i43/svn/code/ThirdPartyWrapper/trunk/org.jfree.jfreechart at revision '2014-03-07T10:36:59.594 +0100'
A         .classpath
A         META-INF
A         META-INF/MANIFEST.MF
AU        jcommon-1.0.12.zip
AU        jfreechart-1.0.9.zip
A         .project
AU        jfreechart-1.0.9-swt.jar
AU        jfreechart-1.0.9-javadocs.zip
A         build.properties
AU        jcommon-1.0.12.jar
AU        jfreechart-1.0.9.jar
A         about_files
A         about_files/JCOMMON-LICENSE.TXT
A         about_files/JFREECHART-SWT-LICENSE.TXT
A         about_files/JFREECHART-LICENSE.TXT
AU        about.html
At revision 21067
no revision recorded for https://svnserver.informatik.kit.edu/i43/svn/code/EDP2 in the previous build
no revision recorded for https://svnserver.informatik.kit.edu/i43/svn/code/Development/de.uka.ipd.sdq.codeconventions in the previous build
no change for https://svnserver.informatik.kit.edu/i43/svn/code/ThirdPartyWrapper/trunk/org.jfree.jfreechart since the previous build
Xvfb starting$ /usr/bin/Xvfb :3 -screen 0 1024x768x24 -fbdir /var/lib/jenkins/2014-03-07_10-36-593023459918667158368xvfb
[workspace] $ /bin/sh -xe /tmp/hudson5164644554580896007.sh
+ '[' -d buckminster.output ']'
+ '[' -d output ']'
Checking for Buckminster Updates
[Buckminster_4.3] $ /var/lib/jenkins/tools/hudson.plugins.buckminster.BuckminsterInstallation/Buckminster_4.3/director/director -vm /var/lib/jenkins/tools/hudson.model.JDK/JDK_1.6/bin/java -d /var/lib/jenkins/tools/hudson.plugins.buckminster.BuckminsterInstallation/Buckminster_4.3/buckminster -p Buckminster -r "http://download.eclipse.org/tools/buckminster/headless-4.3, http://download.cloudsmith.com/buckminster/external-4.3" -uninstallIU "org.eclipse.buckminster.emma.headless.feature.feature.group, org.eclipse.buckminster.pde.headless.feature.feature.group, org.eclipse.buckminster.subclipse.headless.feature.feature.group, org.eclipse.buckminster.maven.headless.feature.feature.group, org.eclipse.buckminster.core.headless.feature.feature.group, org.eclipse.buckminster.git.headless.feature.feature.group, org.eclipse.buckminster.cvs.headless.feature.feature.group" -installIU "org.eclipse.buckminster.emma.headless.feature.feature.group, org.eclipse.buckminster.pde.headless.feature.feature.group, org.eclipse.buckminster.subclipse.headless.feature.feature.group, org.eclipse.buckminster.maven.headless.feature.feature.group, org.eclipse.buckminster.core.headless.feature.feature.group, org.eclipse.buckminster.git.headless.feature.feature.group, org.eclipse.buckminster.cvs.headless.feature.feature.group"
Installing org.eclipse.buckminster.emma.headless.feature.feature.group 1.6.0.v20130317-0829.
Installing org.eclipse.buckminster.pde.headless.feature.feature.group 1.6.0.v20131111-2111.
Installing org.eclipse.buckminster.subclipse.headless.feature.feature.group 1.6.0.v20130317-0829.
Installing org.eclipse.buckminster.maven.headless.feature.feature.group 1.6.0.v20130317-0829.
Installing org.eclipse.buckminster.core.headless.feature.feature.group 1.6.0.v20131003-1606.
Installing org.eclipse.buckminster.git.headless.feature.feature.group 1.6.0.v20130614-0659.
Installing org.eclipse.buckminster.cvs.headless.feature.feature.group 1.6.0.v20130317-0829.
Uninstalling org.eclipse.buckminster.emma.headless.feature.feature.group 1.6.0.v20130317-0829.
Uninstalling org.eclipse.buckminster.pde.headless.feature.feature.group 1.6.0.v20131111-2111.
Uninstalling org.eclipse.buckminster.subclipse.headless.feature.feature.group 1.6.0.v20130317-0829.
Uninstalling org.eclipse.buckminster.maven.headless.feature.feature.group 1.6.0.v20130317-0829.
Uninstalling org.eclipse.buckminster.core.headless.feature.feature.group 1.6.0.v20131003-1606.
Uninstalling org.eclipse.buckminster.git.headless.feature.feature.group 1.6.0.v20130614-0659.
Uninstalling org.eclipse.buckminster.cvs.headless.feature.feature.group 1.6.0.v20130317-0829.
Operation completed in 6643 ms.
[workspace] $ /var/lib/jenkins/tools/hudson.model.JDK/JDK_1.7/bin/java -Dbuckminster.output.root=<https://sdqweb.ipd.kit.edu/jenkins/job/EDP2/ws/buckminster.output> -Dbuckminster.temp.root=<https://sdqweb.ipd.kit.edu/jenkins/job/EDP2/ws/buckminster.temp> -Xmx512m -jar /var/lib/jenkins/tools/hudson.plugins.buckminster.BuckminsterInstallation/Buckminster_4.3/buckminster/plugins/org.eclipse.equinox.launcher_1.3.0.v20130327-1440.jar -application org.eclipse.buckminster.cmdline.headless -data <https://sdqweb.ipd.kit.edu/jenkins/job/EDP2/ws/> --loglevel info -S <https://sdqweb.ipd.kit.edu/jenkins/job/EDP2/ws/commands.txt>
INFO:  setpref 'org.eclipse.buckminster.pde.targetPlatformPath=/var/lib/jenkins/eclipse/instances/edp2-kepler-modelling-sr1/'
INFO:  import 'https://anonymous:anonymous@svnserver.informatik.kit.edu/i43/svn/code/EDP2/trunk/org.palladiosimulator.edp2.buckminster/edp2.cquery'
ERROR   [0006] : An error occurred while collecting items to be installed
  ERROR   [0006] : session context was:(profile=/var/lib/jenkins/eclipse/instances/edp2-kepler-modelling-sr1, phase=org.eclipse.equinox.internal.p2.engine.phases.Collect, operand=, action=).
  ERROR   [0006] : Unable to write to repository: file:/var/lib/jenkins/eclipse/instances/edp2-kepler-modelling-sr1/.
ERROR: An error occurred while collecting items to be installed
  ERROR: session context was:(profile=/var/lib/jenkins/eclipse/instances/edp2-kepler-modelling-sr1, phase=org.eclipse.equinox.internal.p2.engine.phases.Collect, operand=, action=).
  ERROR: Unable to write to repository: file:/var/lib/jenkins/eclipse/instances/edp2-kepler-modelling-sr1/.
java.io.FileNotFoundException: /var/lib/jenkins/eclipse/instances/edp2-kepler-modelling-sr1/plugins/org.jscience_4.1.3.jar (Permission denied)
	at java.io.FileOutputStream.open(Native Method)
	at java.io.FileOutputStream.<init>(FileOutputStream.java:221)
	at java.io.FileOutputStream.<init>(FileOutputStream.java:110)
	at org.eclipse.equinox.internal.p2.artifact.repository.simple.SimpleArtifactRepository.getOutputStream(SimpleArtifactRepository.java:965)
	at org.eclipse.equinox.internal.p2.artifact.repository.MirrorRequest.transferSingle(MirrorRequest.java:259)
	at org.eclipse.equinox.internal.p2.artifact.repository.MirrorRequest.transfer(MirrorRequest.java:208)
	at org.eclipse.equinox.internal.p2.artifact.repository.MirrorRequest.perform(MirrorRequest.java:138)
	at org.eclipse.equinox.internal.p2.artifact.repository.simple.SimpleArtifactRepository.getArtifact(SimpleArtifactRepository.java:707)
	at org.eclipse.equinox.internal.p2.artifact.repository.simple.SimpleArtifactRepository.getArtifacts(SimpleArtifactRepository.java:778)
	at org.eclipse.equinox.internal.p2.engine.DownloadManager.fetch(DownloadManager.java:112)
	at org.eclipse.equinox.internal.p2.engine.DownloadManager.start(DownloadManager.java:100)
	at org.eclipse.equinox.internal.p2.engine.phases.Collect.completePhase(Collect.java:104)
	at org.eclipse.equinox.internal.p2.engine.Phase.postPerform(Phase.java:251)
	at org.eclipse.equinox.internal.p2.engine.Phase.perform(Phase.java:101)
	at org.eclipse.equinox.internal.p2.engine.PhaseSet.perform(PhaseSet.java:47)
	at org.eclipse.equinox.internal.p2.engine.Engine.perform(Engine.java:75)
	at org.eclipse.equinox.internal.p2.engine.Engine.perform(Engine.java:44)
	at org.eclipse.buckminster.core.materializer.P2Materializer.materialize(P2Materializer.java:340)
	at org.eclipse.buckminster.core.materializer.MaterializerJob.run(MaterializerJob.java:64)
	at org.eclipse.core.internal.jobs.Worker.run(Worker.java:53)
ERROR: Errors and Warnings
org.eclipse.core.runtime.CoreException: Errors and Warnings
	at org.eclipse.buckminster.runtime.BuckminsterException.wrap(BuckminsterException.java:96)
	at org.eclipse.buckminster.core.materializer.MaterializationJob.internalRun(MaterializationJob.java:149)
	at org.eclipse.buckminster.core.materializer.MaterializationJob.run(MaterializationJob.java:125)
	at org.eclipse.core.internal.jobs.Worker.run(Worker.java:53)
Contains: [0006] : An error occurred while collecting items to be installed
Contains: [0006] : session context was:(profile=/var/lib/jenkins/eclipse/instances/edp2-kepler-modelling-sr1, phase=org.eclipse.equinox.internal.p2.engine.phases.Collect, operand=, action=).
Contains: [0006] : Unable to write to repository: file:/var/lib/jenkins/eclipse/instances/edp2-kepler-modelling-sr1/.
java.io.FileNotFoundException: /var/lib/jenkins/eclipse/instances/edp2-kepler-modelling-sr1/plugins/org.jscience_4.1.3.jar (Permission denied)
	at java.io.FileOutputStream.open(Native Method)
	at java.io.FileOutputStream.<init>(FileOutputStream.java:221)
	at java.io.FileOutputStream.<init>(FileOutputStream.java:110)
	at org.eclipse.equinox.internal.p2.artifact.repository.simple.SimpleArtifactRepository.getOutputStream(SimpleArtifactRepository.java:965)
	at org.eclipse.equinox.internal.p2.artifact.repository.MirrorRequest.transferSingle(MirrorRequest.java:259)
	at org.eclipse.equinox.internal.p2.artifact.repository.MirrorRequest.transfer(MirrorRequest.java:208)
	at org.eclipse.equinox.internal.p2.artifact.repository.MirrorRequest.perform(MirrorRequest.java:138)
	at org.eclipse.equinox.internal.p2.artifact.repository.simple.SimpleArtifactRepository.getArtifact(SimpleArtifactRepository.java:707)
	at org.eclipse.equinox.internal.p2.artifact.repository.simple.SimpleArtifactRepository.getArtifacts(SimpleArtifactRepository.java:778)
	at org.eclipse.equinox.internal.p2.engine.DownloadManager.fetch(DownloadManager.java:112)
	at org.eclipse.equinox.internal.p2.engine.DownloadManager.start(DownloadManager.java:100)
	at org.eclipse.equinox.internal.p2.engine.phases.Collect.completePhase(Collect.java:104)
	at org.eclipse.equinox.internal.p2.engine.Phase.postPerform(Phase.java:251)
	at org.eclipse.equinox.internal.p2.engine.Phase.perform(Phase.java:101)
	at org.eclipse.equinox.internal.p2.engine.PhaseSet.perform(PhaseSet.java:47)
	at org.eclipse.equinox.internal.p2.engine.Engine.perform(Engine.java:75)
	at org.eclipse.equinox.internal.p2.engine.Engine.perform(Engine.java:44)
	at org.eclipse.buckminster.core.materializer.P2Materializer.materialize(P2Materializer.java:340)
	at org.eclipse.buckminster.core.materializer.MaterializerJob.run(MaterializerJob.java:64)
	at org.eclipse.core.internal.jobs.Worker.run(Worker.java:53)
INFO:  TAG-ID 0006 = Query for org.palladiosimulator.edp2.buckminster:eclipse.feature, path: org.palladiosimulator.edp2.buckminster:eclipse.feature$1.0.0.qualifier -> org.palladiosimulator.edp2.ui.feature:eclipse.feature$1.0.0.qualifier -> org.palladiosimulator.edp2.visualization:osgi.bundle$1.0.0.qualifier -> org.palladiosimulator.edp2.examples:osgi.bundle$1.0.0 -> org.palladiosimulator.edp2:osgi.bundle$2.0.0

Build step 'Run Buckminster' marked build as failure
Xvfb stopping
[CHECKSTYLE] Skipping publisher since build result is FAILURE



More information about the palladio-dev mailing list