[palladio-dev] Build failed in Jenkins: Probe Specification Framework #70

webmaster-sdq at ipd.uka.de webmaster-sdq at ipd.uka.de
Sat Mar 15 07:54:31 CET 2014


See <https://sdqweb.ipd.kit.edu/jenkins/job/Probe%20Specification%20Framework/70/>

------------------------------------------
Started by user Steffen Becker
Building in workspace <https://sdqweb.ipd.kit.edu/jenkins/job/Probe%20Specification%20Framework/ws/>
Updating https://svnserver.informatik.kit.edu/i43/svn/code/ProbeSpecification/trunk/de.uka.ipd.sdq.probespec.buckminster at revision '2014-03-15T07:53:02.636 +0100'
At revision 21230
Updating https://svnserver.informatik.kit.edu/i43/svn/code/ProbeSpecification/trunk/de.uka.ipd.sdq.pipesandfilters.framework at revision '2014-03-15T07:53:02.636 +0100'
At revision 21230
Updating https://svnserver.informatik.kit.edu/i43/svn/code/ProbeSpecification/trunk/de.uka.ipd.sdq.pipesandfilters.framework.recorder.sensorframework at revision '2014-03-15T07:53:02.636 +0100'
At revision 21230
Updating https://svnserver.informatik.kit.edu/i43/svn/code/ProbeSpecification/trunk/de.uka.ipd.sdq.probespec at revision '2014-03-15T07:53:02.636 +0100'
At revision 21230
Updating https://svnserver.informatik.kit.edu/i43/svn/code/ProbeSpecification/trunk/de.uka.ipd.sdq.probespec.edit at revision '2014-03-15T07:53:02.636 +0100'
At revision 21230
Updating https://svnserver.informatik.kit.edu/i43/svn/code/ProbeSpecification/trunk/de.uka.ipd.sdq.probespec.editor at revision '2014-03-15T07:53:02.636 +0100'
At revision 21230
Updating https://svnserver.informatik.kit.edu/i43/svn/code/ProbeSpecification/trunk/de.uka.ipd.sdq.probespec.framework at revision '2014-03-15T07:53:02.636 +0100'
At revision 21230
Updating https://svnserver.informatik.kit.edu/i43/svn/code/ProbeSpecification/trunk/de.uka.ipd.sdq.probespec.framework.probes.example at revision '2014-03-15T07:53:02.636 +0100'
At revision 21230
Updating https://svnserver.informatik.kit.edu/i43/svn/code/ProbeSpecification/trunk/de.uka.ipd.sdq.probespec.tests at revision '2014-03-15T07:53:02.636 +0100'
At revision 21230
Updating https://svnserver.informatik.kit.edu/i43/svn/code/ProbeSpecification/trunk/de.uka.ipd.sdq.probespec.feature at revision '2014-03-15T07:53:02.636 +0100'
At revision 21230
Updating https://svnserver.informatik.kit.edu/i43/svn/code/ThirdPartyWrapper/trunk/org.jscience at revision '2014-03-15T07:53:02.636 +0100'
At revision 21230
Updating https://svnserver.informatik.kit.edu/i43/svn/code/Development/de.uka.ipd.sdq.codeconventions at revision '2014-03-15T07:53:02.636 +0100'
At revision 21230
Updating https://svnserver.informatik.kit.edu/i43/svn/code/ProbeSpecification/trunk/de.uka.ipd.sdq.pipesandfilters.framework.recorder.edp2 at revision '2014-03-15T07:53:02.636 +0100'
At revision 21230
no change for https://svnserver.informatik.kit.edu/i43/svn/code/ProbeSpecification/trunk/de.uka.ipd.sdq.probespec.buckminster since the previous build
no change for https://svnserver.informatik.kit.edu/i43/svn/code/ProbeSpecification/trunk/de.uka.ipd.sdq.pipesandfilters.framework since the previous build
no change for https://svnserver.informatik.kit.edu/i43/svn/code/ProbeSpecification/trunk/de.uka.ipd.sdq.pipesandfilters.framework.recorder.sensorframework since the previous build
no change for https://svnserver.informatik.kit.edu/i43/svn/code/ProbeSpecification/trunk/de.uka.ipd.sdq.probespec since the previous build
no change for https://svnserver.informatik.kit.edu/i43/svn/code/ProbeSpecification/trunk/de.uka.ipd.sdq.probespec.edit since the previous build
no change for https://svnserver.informatik.kit.edu/i43/svn/code/ProbeSpecification/trunk/de.uka.ipd.sdq.probespec.editor since the previous build
no change for https://svnserver.informatik.kit.edu/i43/svn/code/ProbeSpecification/trunk/de.uka.ipd.sdq.probespec.framework since the previous build
no change for https://svnserver.informatik.kit.edu/i43/svn/code/ProbeSpecification/trunk/de.uka.ipd.sdq.probespec.framework.probes.example since the previous build
no change for https://svnserver.informatik.kit.edu/i43/svn/code/ProbeSpecification/trunk/de.uka.ipd.sdq.probespec.tests since the previous build
no change for https://svnserver.informatik.kit.edu/i43/svn/code/ProbeSpecification/trunk/de.uka.ipd.sdq.probespec.feature since the previous build
no change for https://svnserver.informatik.kit.edu/i43/svn/code/ThirdPartyWrapper/trunk/org.jscience since the previous build
no change for https://svnserver.informatik.kit.edu/i43/svn/code/Development/de.uka.ipd.sdq.codeconventions since the previous build
no change for https://svnserver.informatik.kit.edu/i43/svn/code/ProbeSpecification/trunk/de.uka.ipd.sdq.pipesandfilters.framework.recorder.edp2 since the previous build
Xvfb starting$ /usr/bin/Xvfb :4 -screen 0 1024x768x24 -fbdir /var/lib/jenkins/2014-03-15_07-53-028414303275510987782xvfb
[workspace] $ /bin/sh -xe /tmp/hudson7470313928238472758.sh
+ sh /var/lib/jenkins/tools/emma/create_test_launch_scripts.sh
+ '[' -d buckminster.output ']'
+ '[' -d output ']'
Checking for Buckminster Updates
[Buckminster_4.3] $ /var/lib/jenkins/tools/hudson.plugins.buckminster.BuckminsterInstallation/Buckminster_4.3/director/director -vm /var/lib/jenkins/tools/hudson.model.JDK/JDK_1.6/bin/java -d /var/lib/jenkins/tools/hudson.plugins.buckminster.BuckminsterInstallation/Buckminster_4.3/buckminster -p Buckminster -r "http://download.eclipse.org/tools/buckminster/headless-4.3, http://download.cloudsmith.com/buckminster/external-4.3" -uninstallIU "org.eclipse.buckminster.emma.headless.feature.feature.group, org.eclipse.buckminster.pde.headless.feature.feature.group, org.eclipse.buckminster.subclipse.headless.feature.feature.group, org.eclipse.buckminster.maven.headless.feature.feature.group, org.eclipse.buckminster.core.headless.feature.feature.group, org.eclipse.buckminster.git.headless.feature.feature.group, org.eclipse.buckminster.cvs.headless.feature.feature.group" -installIU "org.eclipse.buckminster.emma.headless.feature.feature.group, org.eclipse.buckminster.pde.headless.feature.feature.group, org.eclipse.buckminster.subclipse.headless.feature.feature.group, org.eclipse.buckminster.maven.headless.feature.feature.group, org.eclipse.buckminster.core.headless.feature.feature.group, org.eclipse.buckminster.git.headless.feature.feature.group, org.eclipse.buckminster.cvs.headless.feature.feature.group"
Installing org.eclipse.buckminster.emma.headless.feature.feature.group 1.6.0.v20130317-0829.
Installing org.eclipse.buckminster.pde.headless.feature.feature.group 1.6.0.v20140311-2235.
Installing org.eclipse.buckminster.subclipse.headless.feature.feature.group 1.6.0.v20130317-0829.
Installing org.eclipse.buckminster.maven.headless.feature.feature.group 1.6.0.v20130317-0829.
Installing org.eclipse.buckminster.core.headless.feature.feature.group 1.6.0.v20131003-1606.
Installing org.eclipse.buckminster.git.headless.feature.feature.group 1.6.0.v20130614-0659.
Installing org.eclipse.buckminster.cvs.headless.feature.feature.group 1.6.0.v20130317-0829.
Uninstalling org.eclipse.buckminster.emma.headless.feature.feature.group 1.6.0.v20130317-0829.
Uninstalling org.eclipse.buckminster.pde.headless.feature.feature.group 1.6.0.v20140311-2235.
Uninstalling org.eclipse.buckminster.subclipse.headless.feature.feature.group 1.6.0.v20130317-0829.
Uninstalling org.eclipse.buckminster.maven.headless.feature.feature.group 1.6.0.v20130317-0829.
Uninstalling org.eclipse.buckminster.core.headless.feature.feature.group 1.6.0.v20131003-1606.
Uninstalling org.eclipse.buckminster.git.headless.feature.feature.group 1.6.0.v20130614-0659.
Uninstalling org.eclipse.buckminster.cvs.headless.feature.feature.group 1.6.0.v20130317-0829.
Operation completed in 5373 ms.
[workspace] $ /var/lib/jenkins/tools/hudson.model.JDK/JDK_1.7/bin/java "-Dbuckminster.output.root=<https://sdqweb.ipd.kit.edu/jenkins/job/Probe%20Specification%20Framework/ws/buckminster.output"> "-Dbuckminster.temp.root=<https://sdqweb.ipd.kit.edu/jenkins/job/Probe%20Specification%20Framework/ws/buckminster.temp"> -Xmx512m -jar /var/lib/jenkins/tools/hudson.plugins.buckminster.BuckminsterInstallation/Buckminster_4.3/buckminster/plugins/org.eclipse.equinox.launcher_1.3.0.v20130327-1440.jar -application org.eclipse.buckminster.cmdline.headless -data "<https://sdqweb.ipd.kit.edu/jenkins/job/Probe%20Specification%20Framework/ws/"> --loglevel info -S "<https://sdqweb.ipd.kit.edu/jenkins/job/Probe%20Specification%20Framework/ws/commands.txt">
INFO:  setpref 'org.eclipse.buckminster.jdt.complianceLevel=1.6'
INFO:  setpref 'org.eclipse.buckminster.pde.targetPlatformPath=/var/lib/jenkins/eclipse/instances/probespec-kepler-modelling-sr1/'
INFO:  import 'de.uka.ipd.sdq.probespec.buckminster/probespec.cquery'
ERROR   [0040] : No suitable provider for component org.jfree.jfreechart:osgi.bundle/1.0.9 was found in resourceMap <https://sdqweb.ipd.kit.edu/jenkins/job/Probe%20Specification%20Framework/ws/de.uka.ipd.sdq.probespec.buckminster/probespec.rmap>
  ERROR   [0040] : No suitable provider for component org.jfree.jfreechart:osgi.bundle/1.0.9 was found in searchPath localresources
    ERROR   [0040] : Resolution attempt ended with exception: Provider local(file:///<https://sdqweb.ipd.kit.edu/jenkins/job/Probe%20Specification%20Framework/ws/org.jfree.jfreechart/)>: Missing CSpec source required by component type osgi.bundle
      ERROR   Provider local(file:///<https://sdqweb.ipd.kit.edu/jenkins/job/Probe%20Specification%20Framework/ws/org.jfree.jfreechart/)>: Missing CSpec source required by component type osgi.bundle
  ERROR   [0040] : No suitable provider for component org.jfree.jfreechart:osgi.bundle/1.0.9 was found in searchPath probespec
    ERROR   [0040] : Rejecting provider svn(https://anonymous:anonymous@svnserver.informatik.kit.edu/i43/svn/code/ProbeSpecification/trunk/{0}[https://anonymous:anonymous@svnserver.informatik.kit.edu/i43/svn/code/ProbeSpecification/trunk/org.jfree.jfreechart]): No component match was found
  ERROR   [0040] : No suitable provider for component org.jfree.jfreechart:osgi.bundle/1.0.9 was found in searchPath thirdparty
    ERROR   [0040] : Resolution attempt ended with exception: org.tigris.subversion.svnclientadapter.SVNClientException: org.apache.subversion.javahl.ClientException: svn: E160013: URL 'https://svnserver.informatik.kit.edu/i43/svn/code/ThirdPartyWrapper/trunk/org.jfree.jfreechart' non-existent in that revision
      ERROR   org.tigris.subversion.svnclientadapter.SVNClientException: org.apache.subversion.javahl.ClientException: svn: E160013: URL 'https://svnserver.informatik.kit.edu/i43/svn/code/ThirdPartyWrapper/trunk/org.jfree.jfreechart' non-existent in that revision
  ERROR   [0040] : No suitable provider for component org.jfree.jfreechart:osgi.bundle/1.0.9 was found in searchPath eclipse-release
    ERROR   [0040] : Rejecting provider p2(http://download.eclipse.org/releases/indigo/[http://download.eclipse.org/releases/indigo/]): No component match was found
  ERROR   [0040] : No suitable provider for component org.jfree.jfreechart:osgi.bundle/1.0.9 was found in searchPath orbit
    ERROR   [0040] : Rejecting provider p2(http://download.eclipse.org/tools/orbit/downloads/drops/R20130827064939/repository/[http://download.eclipse.org/tools/orbit/downloads/drops/R20130827064939/repository/]): No component match was found
ERROR   [0025] : No suitable provider for component org.hibernate:osgi.bundle/[3.2.0,4.0.0) was found in resourceMap <https://sdqweb.ipd.kit.edu/jenkins/job/Probe%20Specification%20Framework/ws/de.uka.ipd.sdq.probespec.buckminster/probespec.rmap>
  ERROR   [0025] : No suitable provider for component org.hibernate:osgi.bundle/[3.2.0,4.0.0) was found in searchPath localresources
    ERROR   [0025] : Resolution attempt ended with exception: Provider local(file:///<https://sdqweb.ipd.kit.edu/jenkins/job/Probe%20Specification%20Framework/ws/org.hibernate/)>: Missing CSpec source required by component type osgi.bundle
      ERROR   Provider local(file:///<https://sdqweb.ipd.kit.edu/jenkins/job/Probe%20Specification%20Framework/ws/org.hibernate/)>: Missing CSpec source required by component type osgi.bundle
  ERROR   [0025] : No suitable provider for component org.hibernate:osgi.bundle/[3.2.0,4.0.0) was found in searchPath probespec
    ERROR   [0025] : Rejecting provider svn(https://anonymous:anonymous@svnserver.informatik.kit.edu/i43/svn/code/ProbeSpecification/trunk/{0}[https://anonymous:anonymous@svnserver.informatik.kit.edu/i43/svn/code/ProbeSpecification/trunk/org.hibernate]): No component match was found
  ERROR   [0025] : No suitable provider for component org.hibernate:osgi.bundle/[3.2.0,4.0.0) was found in searchPath thirdparty
    ERROR   [0025] : Resolution attempt ended with exception: org.tigris.subversion.svnclientadapter.SVNClientException: org.apache.subversion.javahl.ClientException: svn: E160013: URL 'https://svnserver.informatik.kit.edu/i43/svn/code/ThirdPartyWrapper/trunk/org.hibernate' non-existent in that revision
      ERROR   org.tigris.subversion.svnclientadapter.SVNClientException: org.apache.subversion.javahl.ClientException: svn: E160013: URL 'https://svnserver.informatik.kit.edu/i43/svn/code/ThirdPartyWrapper/trunk/org.hibernate' non-existent in that revision
  ERROR   [0025] : No suitable provider for component org.hibernate:osgi.bundle/[3.2.0,4.0.0) was found in searchPath eclipse-release
    ERROR   [0025] : Rejecting provider p2(http://download.eclipse.org/releases/indigo/[http://download.eclipse.org/releases/indigo/]): No component match was found
  ERROR   [0025] : No suitable provider for component org.hibernate:osgi.bundle/[3.2.0,4.0.0) was found in searchPath orbit
    ERROR   [0025] : Rejecting provider p2(http://download.eclipse.org/tools/orbit/downloads/drops/R20130827064939/repository/[http://download.eclipse.org/tools/orbit/downloads/drops/R20130827064939/repository/]): No component match was found
INFO:  TAG-ID 0025 = Query for de.uka.ipd.sdq.probespec.buckminster:eclipse.feature, path: de.uka.ipd.sdq.probespec.buckminster:eclipse.feature$2.0.0.qualifier -> de.uka.ipd.sdq.probespec.feature:eclipse.feature$2.0.0.qualifier -> de.uka.ipd.sdq.pipesandfilters.framework.recorder.sensorframework:osgi.bundle$2.0.0.qualifier -> de.uka.ipd.sdq.sensorframework:osgi.bundle$1.1.0.201401091054
TAG-ID 0040 = Query for de.uka.ipd.sdq.probespec.buckminster:eclipse.feature, path: de.uka.ipd.sdq.probespec.buckminster:eclipse.feature$2.0.0.qualifier -> de.uka.ipd.sdq.probespec.feature:eclipse.feature$2.0.0.qualifier -> de.uka.ipd.sdq.pipesandfilters.framework.recorder.edp2:osgi.bundle$2.0.0.qualifier -> org.palladiosimulator.edp2.ui:osgi.bundle$1.0.0.201403141722

Build step 'Run Buckminster' marked build as failure
Xvfb stopping
[CHECKSTYLE] Skipping publisher since build result is FAILURE



More information about the palladio-dev mailing list